{"text_format":"3","workbook":"ods","n_sheets":3,"sheets":["INFO","CALENDARY_MoonPhaase","Calcoli"],"not_rendered":{"images":2},"read":"whole","date_system":"iso_in_file"}

{"sheet":"INFO","index":0,"n_rows":36,"n_cols":13,"rows_kept":36,"merged":[[3,6,6,12],[9,0,16,8],[10,10,16,18],[19,1,21,7],[19,11,21,17],[24,3,24,5],[25,3,25,5],[27,8,27,10],[28,2,30,6],[28,12,30,16],[35,1,38,7],[35,11,38,17]]}
[]
[]
[]
[{"$nulls":6},"Quest'opera è distribuita con LicenzaCreative Commons Attribuzione - Condividi allo stesso modo 4.0 Internazionale.http://creativecommons.org/licenses/by-sa/4.0/"]
[]
[]
[]
[]
[]
["Questo modello di foglio elettronico è distribuito con la convinzione che possa essere utile, ma SENZA NESSUNA GARANZIA, IMPLICITA O ESPLICITA, di nessun genere. In nessun caso l'autore potrà essere ritenuto responsabile per qualsiasi danno diretto, indiretto o accidentale dovuto all'uso di questo prodotto, inclusi (ma non limitati a) perdita di beni, dati, profitti o quant'altro. L'USO DI QUESTO MODELLO DI FOGLIO DI CALCOLO COSTITUISCE DI PER SÈ IMPLICITA ACCETTAZIONE DI QUANTO SOPRA, NONCHÉ DEI TERMINI DELLA LICENZA D'USO."]
[{"$nulls":10},"This spreadsheet model is distributed with the belief that it will be useful, but WITHOUT ANY WARRANTY, IMPLIED OR EXPRESS, of any kind. In no event shall the author be liable for any direct, indirect or incidental damages due to the use of this product, including (but not limited to) loss of property, data, profits or whatever. USE OF THIS MODEL SHEET OF CALCULATION IS IN ITSELF IMPLIED ACCEPTANCE OF THE FOREGOING, AND THE TERMS OF THE LICENSE."]
{"$rows_empty":8}
[null,"Ti piace il mio lavoro ?   Pensi che sia utile ?                                                          Inviami un email di incoraggiamento, magari per segnalarmi possibili malfunzionamenti, bugs o, meglio ancora, eventuali suggerimenti per migliorare il presente lavoro.",{"$nulls":9},"Like my work ?  Do you think that it is useful ?                                                    Send me an email of encouragement, perhaps to signal me possible malfunctions, bugs or, better yet, any suggestions to improve this work."]
[]
[]
[]
[]
[{"$nulls":3},"Pubblicato in collaborazione con:"]
[{"$nulls":3},"https://www.libresoftwareclub.it/"]
[{"$nulls":9},"per contatti:"]
[{"$nulls":8},"mailto:arck-a.borghini@libero.it"]
[null,null,"Tengo infine a precisare che negli orari riportati é possibile riscontrare errori pari a circa 2/3 minuti.",{"$nulls":9},"Finally, I should point out that in the times shown it is possible to encounter errors approximately 2/3 minutes."]
[]
[]
[]
[]
[]
[]
[null,"Un particolare ringraziamento va al grande astronomo JEAN MEEUS che con il suo libro “Astronomia con il computer”, pubblicato per la prima volta nel lontano 1979, ci ha insegnato le formule per poter calcolare le fasi lunari, e tante altre belle cose…",{"$nulls":9},"Special thanks to the great astronomer JEAN MEEUS that with his book \"Astronomical Formulae for Calculators\", published for the first time in 1979, he taught us the formulas to calculate the moon phase, and many other beautiful things …"]

{"sheet":"CALENDARY_MoonPhaase","index":1,"n_rows":31,"n_cols":24,"rows_kept":31,"merged":[[1,6,1,11],[1,12,1,13],[1,21,1,22],[1,23,1,25],[3,0,3,3],[3,5,3,8],[3,10,3,13],[3,15,3,18],[11,0,11,3],[11,5,11,8],[11,10,11,13],[11,15,11,18],[19,0,19,3],[19,5,19,8],[19,10,19,13],[19,15,19,18],[28,1,28,2],[29,0,29,3],[29,4,29,5],[29,6,29,8],[29,9,29,10],[29,13,29,15],[30,0,30,3],[30,4,30,5],[30,6,30,8],[30,9,30,10],[30,13,30,15]]}
[]
[{"$nulls":6},"MoonPhase  ®",{"$nulls":5},"  by “ab Solutions”",{"$nulls":8},2017,null,"  < < <   inserisci qui l'anno"]
[]
[{"$f":"of:=\"Gennaio \"&YEAR([Calcoli.D4])","v":"Gennaio 2017"},{"$nulls":4},{"$f":"of:=\"Febbraio \"&YEAR([Calcoli.G4])","v":"Febbraio 2017"},{"$nulls":4},{"$f":"of:=\"Marzo \"&YEAR([Calcoli.J4])","v":"Marzo 2017"},{"$nulls":4},{"$f":"of:=\"Aprile \"&YEAR([Calcoli.M4])","v":"Aprile 2017"}]
[{"$f":"of:=IF([.B5]=[Calcoli.B169];\"L.N. \";IF([.B5]=[Calcoli.B185];\"P.Q. \";IF([.B5]=[Calcoli.B201];\"L.P. \";IF([.B5]=[Calcoli.B217];\"U.Q. \";IF([.B5]=[Calcoli.E61];\"L.N. \";\"\")))))","v":"P.Q. "},{"$f":"of:=IF(MONTH([Calcoli.B169])=1;[Calcoli.B169];IF(MONTH([Calcoli.B185])=1;[Calcoli.B185];IF(MONTH([Calcoli.B201])=1;[Calcoli.B201];IF(MONTH([Calcoli.B217])=1;[Calcoli.B217];IF(MONTH([Calcoli.E61])=1;[Calcoli.E61];\"\")))))","v":"2017-01-05"},{"$f":"of:=IF([.B5]=\"\";\"\";\"alle ore \")","v":"alle ore "},{"$f":"of:=IF([.B5]=[Calcoli.B169];TIME([Calcoli.B170];[Calcoli.B171];[Calcoli.B172]);IF([.B5]=[Calcoli.B185];TIME([Calcoli.B186];[Calcoli.B187];[Calcoli.B188]);IF([.B5]=[Calcoli.B201];TIME([Calcoli.B202];[Calcoli.B203];[Calcoli.B204]);IF([.B5]=[Calcoli.B217];TIME([Calcoli.B218];[Calcoli.B219];[Calcoli.B220]);IF([.B5]=[Calcoli.E61];TIME([Calcoli.E62];[Calcoli.E63];[Calcoli.E64]);\"\")))))","v":"PT20H43M58S"},null,{"$f":"of:=IF([.G5]=[Calcoli.E169];\"L.N. \";IF([.G5]=[Calcoli.E185];\"P.Q. \";IF([.G5]=[Calcoli.E201];\"L.P. \";IF([.G5]=[Calcoli.E217];\"U.Q. \";IF([.G5]=[Calcoli.H61];\"L.N. \";\"\")))))","v":"P.Q. "},{"$f":"of:=IF(MONTH([Calcoli.E169])=2;[Calcoli.E169];IF(MONTH([Calcoli.E185])=2;[Calcoli.E185];IF(MONTH([Calcoli.E201])=2;[Calcoli.E201];IF(MONTH([Calcoli.E217])=2;[Calcoli.E217];IF(MONTH([Calcoli.H61])=2;[Calcoli.H61];\"\")))))","v":"2017-02-04"},{"$f":"of:=IF([.G5]=\"\";\"\";\"alle ore \")","v":"alle ore "},{"$f":"of:=IF([.G5]=[Calcoli.E169];TIME([Calcoli.E170];[Calcoli.E171];[Calcoli.E172]);IF([.G5]=[Calcoli.E185];TIME([Calcoli.E186];[Calcoli.E187];[Calcoli.E188]);IF([.G5]=[Calcoli.E201];TIME([Calcoli.E202];[Calcoli.E203];[Calcoli.E204]);IF([.G5]=[Calcoli.E217];TIME([Calcoli.E218];[Calcoli.E219];[Calcoli.E220]);IF([.G5]=[Calcoli.H61];TIME([Calcoli.H62];[Calcoli.H63];[Calcoli.H64]);\"\")))))","v":"PT05H15M53S"},null,{"$f":"of:=IF([.L5]=[Calcoli.H169];\"L.N. \";IF([.L5]=[Calcoli.H185];\"P.Q. \";IF([.L5]=[Calcoli.H201];\"L.P. \";IF([.L5]=[Calcoli.H217];\"U.Q. \";IF([.L5]=[Calcoli.K61];\"L.N. \";\"\")))))","v":"P.Q. "},{"$f":"of:=IF(MONTH([Calcoli.H169])=3;[Calcoli.H169];IF(MONTH([Calcoli.H185])=3;[Calcoli.H185];IF(MONTH([Calcoli.H201])=3;[Calcoli.H201];IF(MONTH([Calcoli.H217])=3;[Calcoli.H217];IF(MONTH([Calcoli.K61])=3;[Calcoli.K61];\"\")))))","v":"2017-03-05"},{"$f":"of:=IF([.L5]=\"\";\"\";\"alle ore \")","v":"alle ore "},{"$f":"of:=IF([.L5]=[Calcoli.H169];TIME([Calcoli.H170];[Calcoli.H171];[Calcoli.H172]);IF([.L5]=[Calcoli.H185];TIME([Calcoli.H186];[Calcoli.H187];[Calcoli.H188]);IF([.L5]=[Calcoli.H201];TIME([Calcoli.H202];[Calcoli.H203];[Calcoli.H204]);IF([.L5]=[Calcoli.H217];TIME([Calcoli.H218];[Calcoli.H219];[Calcoli.H220]);IF([.L5]=[Calcoli.K61];TIME([Calcoli.K62];[Calcoli.K63];[Calcoli.K64]);\"\")))))","v":"PT12H29M36S"},null,{"$f":"of:=IF([.Q5]=[Calcoli.K169];\"L.N. \";IF([.Q5]=[Calcoli.K185];\"P.Q. \";IF([.Q5]=[Calcoli.K201];\"L.P. \";IF([.Q5]=[Calcoli.K217];\"U.Q. \";IF([.Q5]=[Calcoli.N61];\"L.N. \";\"\")))))","v":"P.Q. "},{"$f":"of:=IF(MONTH([Calcoli.K169])=4;[Calcoli.K169];IF(MONTH([Calcoli.K185])=4;[Calcoli.K185];IF(MONTH([Calcoli.K201])=4;[Calcoli.K201];IF(MONTH([Calcoli.K217])=4;[Calcoli.K217];IF(MONTH([Calcoli.N61])=4;[Calcoli.N61];\"\")))))","v":"2017-04-03"},{"$f":"of:=IF([.Q5]=\"\";\"\";\"alle ore \")","v":"alle ore "},{"$f":"of:=IF([.Q5]=[Calcoli.K169];TIME([Calcoli.K170];[Calcoli.K171];[Calcoli.K172]);IF([.Q5]=[Calcoli.K185];TIME([Calcoli.K186];[Calcoli.K187];[Calcoli.K188]);IF([.Q5]=[Calcoli.K201];TIME([Calcoli.K202];[Calcoli.K203];[Calcoli.K204]);IF([.Q5]=[Calcoli.K217];TIME([Calcoli.K218];[Calcoli.K219];[Calcoli.K220]);IF([.Q5]=[Calcoli.N61];TIME([Calcoli.N62];[Calcoli.N63];[Calcoli.N64]);\"\")))))+TIME(1;0;0)","v":"PT20H36M51S"}]
[{"$f":"of:=IF([.B6]=\"\";\"\";IF([.A5]=\"L.N. \";\"P.Q. \";IF([.A5]=\"P.Q. \";\"L.P. \";IF([.A5]=\"L.P. \";\"U.Q. \";IF([.A5]=\"U.Q. \";\"L.N. \";\"\")))))","v":"L.P. "},{"$f":"of:=IF(MONTH([Calcoli.B185])=1                                  AND                                        ([Calcoli.B185]-[.B5]>1)                               AND                                        ([Calcoli.B185]-[.B5]<10);[Calcoli.B185];IF(MONTH([Calcoli.B201])=1                              AND                                        ([Calcoli.B201]-[.B5]>1)                                   AND                                        ([Calcoli.B201]-[.B5]<10);[Calcoli.B201];IF(MONTH([Calcoli.B217])=1                            AND                                        ([Calcoli.B217]-[.B5]>1)                                        AND                                        ([Calcoli.B217]-[.B5]<10);[Calcoli.B217];IF(MONTH([Calcoli.E61])=1                                        AND                                        ([Calcoli.E61]-[.B5]>1)                                AND                                 ([Calcoli.E61]-[.B5]<10);[Calcoli.E61];IF(MONTH([Calcoli.E77])=1                                       AND                                       ([Calcoli.E77]-[.B5]>1)                                    AND                                       ([Calcoli.E77]-[.B5]<10);[Calcoli.E77];\"\")))))","v":"2017-01-12"},{"$f":"of:=IF([.B6]=\"\";\"\";\"alle ore \")","v":"alle ore "},{"$f":"of:=IF([.B6]=[Calcoli.B185];TIME([Calcoli.B186];[Calcoli.B187];[Calcoli.B188]);IF([.B6]=[Calcoli.B201];TIME([Calcoli.B202];[Calcoli.B203];[Calcoli.B204]);IF([.B6]=[Calcoli.B217];TIME([Calcoli.B218];[Calcoli.B219];[Calcoli.B220]);IF([.B6]=[Calcoli.E61];TIME([Calcoli.E62];[Calcoli.E63];[Calcoli.E64]);IF([.B6]=[Calcoli.E77];TIME([Calcoli.E78];[Calcoli.E79];[Calcoli.E80]);\"\")))))","v":"PT12H35M13S"},null,{"$f":"of:=IF([.G6]=\"\";\"\";IF([.F5]=\"L.N. \";\"P.Q. \";IF([.F5]=\"P.Q. \";\"L.P. \";IF([.F5]=\"L.P. \";\"U.Q. \";IF([.F5]=\"U.Q. \";\"L.N. \";\"\")))))","v":"L.P. "},{"$f":"of:=IF(MONTH([Calcoli.E185])=2                                   AND                                         ([Calcoli.E185]-[.G5]>1)                                AND                                         ([Calcoli.E185]-[.G5]<10);[Calcoli.E185];IF(MONTH([Calcoli.E201])=2                               AND                                         ([Calcoli.E201]-[.G5]>1)                                    AND                                         ([Calcoli.E201]-[.G5]<10);[Calcoli.E201];IF(MONTH([Calcoli.E217])=2                             AND                                         ([Calcoli.E217]-[.G5]>1)                                         AND                                         ([Calcoli.E217]-[.G5]<10);[Calcoli.E217];IF(MONTH([Calcoli.H61])=2                                         AND                                         ([Calcoli.H61]-[.G5]>1)                                 AND                                  ([Calcoli.H61]-[.G5]<10);[Calcoli.H61];IF(MONTH([Calcoli.H77])=2                                        AND                                        ([Calcoli.H77]-[.G5]>1)                                     AND                                        ([Calcoli.H77]-[.G5]<10);[Calcoli.H77];\"\")))))","v":"2017-02-11"},{"$f":"of:=IF([.G6]=\"\";\"\";\"alle ore \")","v":"alle ore "},{"$f":"of:=IF([.G6]=[Calcoli.E185];TIME([Calcoli.E186];[Calcoli.E187];[Calcoli.E188]);IF([.G6]=[Calcoli.E201];TIME([Calcoli.E202];[Calcoli.E203];[Calcoli.E204]);IF([.G6]=[Calcoli.E217];TIME([Calcoli.E218];[Calcoli.E219];[Calcoli.E220]);IF([.G6]=[Calcoli.H61];TIME([Calcoli.H62];[Calcoli.H63];[Calcoli.H64]);IF([.G6]=[Calcoli.H77];TIME([Calcoli.H78];[Calcoli.H79];[Calcoli.H80]);\"\")))))","v":"PT01H34M07S"},null,{"$f":"of:=IF([.L6]=\"\";\"\";IF([.K5]=\"L.N. \";\"P.Q. \";IF([.K5]=\"P.Q. \";\"L.P. \";IF([.K5]=\"L.P. \";\"U.Q. \";IF([.K5]=\"U.Q. \";\"L.N. \";\"\")))))","v":"L.P. "},{"$f":"of:=IF(MONTH([Calcoli.H185])=3                                     AND                                           ([Calcoli.H185]-[.L5]>1)                                  AND                                           ([Calcoli.H185]-[.L5]<10);[Calcoli.H185];IF(MONTH([Calcoli.H201])=3                                 AND                                           ([Calcoli.H201]-[.L5]>1)                                      AND                                           ([Calcoli.H201]-[.L5]<10);[Calcoli.H201];IF(MONTH([Calcoli.H217])=3                               AND                                           ([Calcoli.H217]-[.L5]>1)                                           AND                                           ([Calcoli.H217]-[.L5]<10);[Calcoli.H217];IF(MONTH([Calcoli.K61])=3                                           AND                                           ([Calcoli.K61]-[.L5]>1)                                   AND                                    ([Calcoli.K61]-[.L5]<10);[Calcoli.K61];IF(MONTH([Calcoli.K77])=3                                          AND                                          ([Calcoli.K77]-[.L5]>1)                                       AND                                          ([Calcoli.K77]-[.L5]<10);[Calcoli.K77];\"\")))))","v":"2017-03-12"},{"$f":"of:=IF([.L6]=\"\";\"\";\"alle ore \")","v":"alle ore "},{"$f":"of:=IF([.L6]=[Calcoli.H185];TIME([Calcoli.H186];[Calcoli.H187];[Calcoli.H188]);IF([.L6]=[Calcoli.H201];TIME([Calcoli.H202];[Calcoli.H203];[Calcoli.H204]);IF([.L6]=[Calcoli.H217];TIME([Calcoli.H218];[Calcoli.H219];[Calcoli.H220]);IF([.L6]=[Calcoli.K61];TIME([Calcoli.K62];[Calcoli.K63];[Calcoli.K64]);IF([.L6]=[Calcoli.K77];TIME([Calcoli.K78];[Calcoli.K79];[Calcoli.K80]);\"\")))))","v":"PT15H54M57S"},null,{"$f":"of:=IF([.Q6]=\"\";\"\";IF([.P5]=\"L.N. \";\"P.Q. \";IF([.P5]=\"P.Q. \";\"L.P. \";IF([.P5]=\"L.P. \";\"U.Q. \";IF([.P5]=\"U.Q. \";\"L.N. \";\"\")))))","v":"L.P. "},{"$f":"of:=IF(MONTH([Calcoli.K185])=4                                      AND                                            ([Calcoli.K185]-[.Q5]>1)                                   AND                                            ([Calcoli.K185]-[.Q5]<10);[Calcoli.K185];IF(MONTH([Calcoli.K201])=4                                  AND                                            ([Calcoli.K201]-[.Q5]>1)                                       AND                                            ([Calcoli.K201]-[.Q5]<10);[Calcoli.K201];IF(MONTH([Calcoli.K217])=4                                AND                                            ([Calcoli.K217]-[.Q5]>1)                                            AND                                            ([Calcoli.K217]-[.Q5]<10);[Calcoli.K217];IF(MONTH([Calcoli.N61])=4                                            AND                                            ([Calcoli.N61]-[.Q5]>1)                                    AND                                     ([Calcoli.N61]-[.Q5]<10);[Calcoli.N61];IF(MONTH([Calcoli.N77])=4                                           AND                                           ([Calcoli.N77]-[.Q5]>1)                                        AND                                           ([Calcoli.N77]-[.Q5]<10);[Calcoli.N77];\"\")))))","v":"2017-04-11"},{"$f":"of:=IF([.Q6]=\"\";\"\";\"alle ore \")","v":"alle ore "},{"$f":"of:=IF([.Q6]=[Calcoli.K185];TIME([Calcoli.K186];[Calcoli.K187];[Calcoli.K188]);IF([.Q6]=[Calcoli.K201];TIME([Calcoli.K202];[Calcoli.K203];[Calcoli.K204]);IF([.Q6]=[Calcoli.K217];TIME([Calcoli.K218];[Calcoli.K219];[Calcoli.K220]);IF([.Q6]=[Calcoli.N61];TIME([Calcoli.N62];[Calcoli.N63];[Calcoli.N64]);IF([.Q6]=[Calcoli.N77];TIME([Calcoli.N78];[Calcoli.N79];[Calcoli.N80]);\"\")))))+TIME(1;0;0)","v":"PT08H09M30S"},null,{"$f":"of:=IF([.V6]=[Calcoli.B169];\"L.N. \";IF([.V6]=[Calcoli.B185];\"P.Q. \";IF([.V6]=[Calcoli.B201];\"L.P. \";IF([.V6]=[Calcoli.B217];\"U.Q. \";\"\"))))","v":null}]
[{"$f":"of:=IF([.B7]=\"\";\"\";IF([.A6]=\"L.N. \";\"P.Q. \";IF([.A6]=\"P.Q. \";\"L.P. \";IF([.A6]=\"L.P. \";\"U.Q. \";IF([.A6]=\"U.Q. \";\"L.N. \";\"\")))))","v":"U.Q. "},{"$f":"of:=IF(MONTH([Calcoli.B201])=1                                   AND                                         ([Calcoli.B201]-[.B6]>1)                                AND                                         ([Calcoli.B201]-[.B6]<10);[Calcoli.B201];IF(MONTH([Calcoli.B217])=1                               AND                                         ([Calcoli.B217]-[.B6]>1)                                    AND                                         ([Calcoli.B217]-[.B6]<10);[Calcoli.B217];IF(MONTH([Calcoli.E61])=1                             AND                                         ([Calcoli.E61]-[.B6]>1)                                         AND                                         ([Calcoli.E61]-[.B6]<10);[Calcoli.E61];IF(MONTH([Calcoli.E77])=1                                         AND                                         ([Calcoli.E77]-[.B6]>1)                                 AND                                  ([Calcoli.E77]-[.B6]<10);[Calcoli.E77];IF(MONTH([Calcoli.E93])=1                                        AND                                        ([Calcoli.E93]-[.B6]>1)                                     AND                                        ([Calcoli.E93]-[.B6]<10);[Calcoli.E93];IF(MONTH([Calcoli.E109])=1                                        AND                                        ([Calcoli.E109]-[.B6]>1)                                     AND                                        ([Calcoli.E109]-[.B6]<10);[Calcoli.E109];IF(MONTH([Calcoli.E169])=1                                        AND                                        ([Calcoli.E169]-[.B6]>1)                                     AND                                        ([Calcoli.E169]-[.B6]<10);[Calcoli.E169];\"\")))))))","v":"2017-01-19"},{"$f":"of:=IF([.B7]=\"\";\"\";\"alle ore \")","v":"alle ore "},{"$f":"of:=IF([.B7]=[Calcoli.B201];TIME([Calcoli.B202];[Calcoli.B203];[Calcoli.B204]);IF([.B7]=[Calcoli.B217];TIME([Calcoli.B218];[Calcoli.B219];[Calcoli.B220]);IF([.B7]=[Calcoli.E61];TIME([Calcoli.E62];[Calcoli.E63];[Calcoli.E64]);IF([.B7]=[Calcoli.E77];TIME([Calcoli.E78];[Calcoli.E79];calcoli:80);IF([.B7]=[Calcoli.E93];TIME([Calcoli.E94];[Calcoli.E95];[Calcoli.E96]);IF([.B7]=[Calcoli.E109];TIME([Calcoli.E110];[Calcoli.E111];[Calcoli.E112]);IF([.B7]=[Calcoli.E169];TIME([Calcoli.E170];[Calcoli.E171];[Calcoli.E172]);\"\")))))))","v":"PT23H14M28S"},null,{"$f":"of:=IF([.G7]=\"\";\"\";IF([.F6]=\"L.N. \";\"P.Q. \";IF([.F6]=\"P.Q. \";\"L.P. \";IF([.F6]=\"L.P. \";\"U.Q. \";IF([.F6]=\"U.Q. \";\"L.N. \";\"\")))))","v":"U.Q. "},{"$f":"of:=IF(MONTH([Calcoli.E201])=2                                   AND                                         ([Calcoli.E201]-[.G6]>1)                                AND                                         ([Calcoli.E201]-[.G6]<10);[Calcoli.E201];IF(MONTH([Calcoli.E217])=2                               AND                                         ([Calcoli.E217]-[.G6]>1)                                    AND                                         ([Calcoli.E217]-[.G6]<10);[Calcoli.E217];IF(MONTH([Calcoli.H61])=2                             AND                                         ([Calcoli.H61]-[.G6]>1)                                         AND                                         ([Calcoli.H61]-[.G6]<10);[Calcoli.H61];IF(MONTH([Calcoli.H77])=2                                         AND                                         ([Calcoli.H77]-[.G6]>1)                                 AND                                  ([Calcoli.H77]-[.G6]<10);[Calcoli.H77];IF(MONTH([Calcoli.H93])=2                                        AND                                        ([Calcoli.H93]-[.G6]>1)                                     AND                                        ([Calcoli.H93]-[.G6]<10);[Calcoli.H93];IF(MONTH([Calcoli.H109])=2                                        AND                                        ([Calcoli.H109]-[.G6]>1)                                     AND                                        ([Calcoli.H109]-[.G6]<10);[Calcoli.H109];IF(MONTH([Calcoli.H169])=2                                        AND                                        ([Calcoli.H169]-[.G6]>1)                                     AND                                        ([Calcoli.H169]-[.G6]<10);[Calcoli.H169];\"\")))))))","v":"2017-02-18"},{"$f":"of:=IF([.G7]=\"\";\"\";\"alle ore \")","v":"alle ore "},{"$f":"of:=IF([.G7]=[Calcoli.E201];TIME([Calcoli.E202];[Calcoli.E203];[Calcoli.E204]);IF([.G7]=[Calcoli.E217];TIME([Calcoli.E218];[Calcoli.E219];[Calcoli.E220]);IF([.G7]=[Calcoli.H61];TIME([Calcoli.H62];[Calcoli.H63];[Calcoli.H64]);IF([.G7]=[Calcoli.H77];TIME([Calcoli.H78];[Calcoli.H79];[Calcoli.H80]);IF([.G7]=[Calcoli.H93];TIME([Calcoli.H94];[Calcoli.H95];[Calcoli.H96]);IF([.G7]=[Calcoli.H109];TIME([Calcoli.H110];[Calcoli.H111];[Calcoli.H112]);IF([.G7]=[Calcoli.H169];TIME([Calcoli.H170];[Calcoli.H171];[Calcoli.H172]);\"\")))))))","v":"PT20H35M29S"},null,{"$f":"of:=IF([.L7]=\"\";\"\";IF([.K6]=\"L.N. \";\"P.Q. \";IF([.K6]=\"P.Q. \";\"L.P. \";IF([.K6]=\"L.P. \";\"U.Q. \";IF([.K6]=\"U.Q. \";\"L.N. \";\"\")))))","v":"U.Q. "},{"$f":"of:=IF(MONTH([Calcoli.H201])=3                                  AND                                            ([Calcoli.H201]-[.L6]>1)                                       AND                                            ([Calcoli.H201]-[.L6]<10);[Calcoli.H201];IF(MONTH([Calcoli.H217])=3                                AND                                            ([Calcoli.H217]-[.L6]>1)                                            AND                                            ([Calcoli.H217]-[.L6]<10);[Calcoli.H217];IF(MONTH([Calcoli.K61])=3                                            AND                                            ([Calcoli.K61]-[.L6]>1)                                    AND                                     ([Calcoli.K61]-[.L6]<10);[Calcoli.K61];IF(MONTH([Calcoli.K77])=3                                           AND                                           ([Calcoli.K77]-[.L6]>1)                                        AND                                           ([Calcoli.K77]-[.L6]<10);[Calcoli.K77];IF(MONTH([Calcoli.K93])=3                                      AND                                            ([Calcoli.K93]-[.L6]>1)                                   AND                                            ([Calcoli.K93]-[.L6]<10);[Calcoli.K93];IF(MONTH([Calcoli.K109])=3                                      AND                                            ([Calcoli.K109]-[.L6]>1)                                   AND                                            ([Calcoli.K109]-[.L6]<10);[Calcoli.K109];IF(MONTH([Calcoli.K169])=3                                      AND                                            ([Calcoli.K169]-[.L6]>1)                                   AND                                            ([Calcoli.K169]-[.L6]<10);[Calcoli.K169];\"\")))))))","v":"2017-03-20"},{"$f":"of:=IF([.L7]=\"\";\"\";\"alle ore \")","v":"alle ore "},{"$f":"of:=IF([.L7]=[Calcoli.H201];TIME([Calcoli.H202];[Calcoli.H203];[Calcoli.H204]);IF([.L7]=[Calcoli.H217];TIME([Calcoli.H218];[Calcoli.H219];[Calcoli.H220]);IF([.L7]=[Calcoli.K61];TIME([Calcoli.K62];[Calcoli.K63];[Calcoli.K64]);IF([.L7]=[Calcoli.K77];TIME([Calcoli.K78];[Calcoli.K79];[Calcoli.K80]);IF([.L7]=[Calcoli.K93];TIME([Calcoli.K94];[Calcoli.K95];[Calcoli.K96]);IF([.L7]=[Calcoli.K109];TIME([Calcoli.K110];[Calcoli.K111];[Calcoli.K112]);IF([.L7]=[Calcoli.K169];TIME([Calcoli.K170];[Calcoli.K171];[Calcoli.K172]);\"\")))))))","v":"PT17H02M05S"},null,{"$f":"of:=IF([.Q7]=\"\";\"\";IF([.P6]=\"L.N. \";\"P.Q. \";IF([.P6]=\"P.Q. \";\"L.P. \";IF([.P6]=\"L.P. \";\"U.Q. \";IF([.P6]=\"U.Q. \";\"L.N. \";\"\")))))","v":"U.Q. "},{"$f":"of:=IF(MONTH([Calcoli.K201])=4                                   AND                                             ([Calcoli.K201]-[.Q6]>1)                                        AND                                             ([Calcoli.K201]-[.Q6]<10);[Calcoli.K201];IF(MONTH([Calcoli.K217])=4                                 AND                                             ([Calcoli.K217]-[.Q6]>1)                                             AND                                             ([Calcoli.K217]-[.Q6]<10);[Calcoli.K217];IF(MONTH([Calcoli.N61])=4                                             AND                                             ([Calcoli.N61]-[.Q6]>1)                                     AND                                      ([Calcoli.N61]-[.Q6]<10);[Calcoli.N61];IF(MONTH([Calcoli.N77])=4                                            AND                                            ([Calcoli.N77]-[.Q6]>1)                                         AND                                            ([Calcoli.N77]-[.Q6]<10);[Calcoli.N77];IF(MONTH([Calcoli.N93])=4                                       AND                                             ([Calcoli.N93]-[.Q6]>1)                                    AND                                             ([Calcoli.N93]-[.Q6]<10);[Calcoli.N93];IF(MONTH([Calcoli.N109])=4                                       AND                                             ([Calcoli.N109]-[.Q6]>1)                                    AND                                             ([Calcoli.N109]-[.Q6]<10);[Calcoli.N109];IF(MONTH([Calcoli.N169])=4                                       AND                                             ([Calcoli.N169]-[.Q6]>1)                                    AND                                             ([Calcoli.N169]-[.Q6]<10);[Calcoli.N169];\"\")))))))","v":"2017-04-19"},{"$f":"of:=IF([.Q7]=\"\";\"\";\"alle ore \")","v":"alle ore "},{"$f":"of:=IF([.Q7]=[Calcoli.K201];TIME([Calcoli.K202];[Calcoli.K203];[Calcoli.K204]);IF([.Q7]=[Calcoli.K217];TIME([Calcoli.K218];[Calcoli.K219];[Calcoli.K220]);IF([.Q7]=[Calcoli.N61];TIME([Calcoli.N62];[Calcoli.N63];[Calcoli.N64]);IF([.Q7]=[Calcoli.N77];TIME([Calcoli.N78];[Calcoli.N79];[Calcoli.N80]);IF([.Q7]=[Calcoli.N93];TIME([Calcoli.N94];[Calcoli.N95];[Calcoli.N96]);IF([.Q7]=[Calcoli.N109];TIME([Calcoli.N110];[Calcoli.N111];[Calcoli.N112]);IF([.Q7]=[Calcoli.N169];TIME([Calcoli.N170];[Calcoli.N171];[Calcoli.N172]);\"\")))))))+TIME(1;0;0)","v":"PT12H01M13S"}]
[{"$f":"of:=IF([.B8]=\"\";\"\";IF([.A7]=\"L.N. \";\"P.Q. \";IF([.A7]=\"P.Q. \";\"L.P. \";IF([.A7]=\"L.P. \";\"U.Q. \";IF([.A7]=\"U.Q. \";\"L.N. \";\"\")))))","v":"L.N. "},{"$f":"of:=IF(MONTH([Calcoli.B217])=1                                   AND                                         ([Calcoli.B217]-[.B7]>1)                                AND                                         ([Calcoli.B217]-[.B7]<10);[Calcoli.B217];IF(MONTH([Calcoli.E61])=1                               AND                                         ([Calcoli.E61]-[.B7]>1)                                    AND                                         ([Calcoli.E61]-[.B7]<10);[Calcoli.E61];IF(MONTH([Calcoli.E77])=1                             AND                                         ([Calcoli.E77]-[.B7]>1)                                         AND                                         ([Calcoli.E77]-[.B7]<10);[Calcoli.E77];IF(MONTH([Calcoli.E93])=1                                         AND                                         ([Calcoli.E93]-[.B7]>1)                                 AND                                  ([Calcoli.E93]-[.B7]<10);[Calcoli.E93];IF(MONTH([Calcoli.E109])=1                                        AND                                        ([Calcoli.E109]-[.B7]>1)                                     AND                                        ([Calcoli.E109]-[.B7]<10);[Calcoli.E109];IF(MONTH([Calcoli.E169])=1                                        AND                                        ([Calcoli.E169]-[.B7]>1)                                     AND                                        ([Calcoli.E169]-[.B7]<10);[Calcoli.E169];IF(MONTH([Calcoli.E185])=1                                        AND                                        ([Calcoli.E185]-[.B7]>1)                                     AND                                        ([Calcoli.E185]-[.B7]<10);[Calcoli.E185];\"\")))))))","v":"2017-01-28"},{"$f":"of:=IF([.B8]=\"\";\"\";\"alle ore \")","v":"alle ore "},{"$f":"of:=IF([.B8]=[Calcoli.B217];TIME([Calcoli.B218];[Calcoli.B219];[Calcoli.B220]);IF([.B8]=[Calcoli.E61];TIME([Calcoli.E62];[Calcoli.E63];[Calcoli.E64]);IF([.B8]=[Calcoli.E77];TIME([Calcoli.E78];[Calcoli.E79];[Calcoli.E80]);IF([.B8]=[Calcoli.E93];TIME([Calcoli.E94];[Calcoli.E95];[Calcoli.E96]);IF([.B8]=[Calcoli.E109];TIME([Calcoli.E110];[Calcoli.E111];[Calcoli.E112]);IF([.B8]=[Calcoli.E169];TIME([Calcoli.E170];[Calcoli.E171];[Calcoli.E172]);IF([.B8]=[Calcoli.E185];TIME([Calcoli.E186];[Calcoli.E187];[Calcoli.E188]);\"\")))))))","v":"PT01H08M29S"},null,{"$f":"of:=IF([.G8]=\"\";\"\";IF([.F7]=\"L.N. \";\"P.Q. \";IF([.F7]=\"P.Q. \";\"L.P. \";IF([.F7]=\"L.P. \";\"U.Q. \";IF([.F7]=\"U.Q. \";\"L.N. \";\"\")))))","v":"L.N. "},{"$f":"of:=IF(MONTH([Calcoli.E217])=2                                    AND                                          ([Calcoli.E217]-[.G7]>1)                                 AND                                          ([Calcoli.E217]-[.G7]<10);[Calcoli.E217];IF(MONTH([Calcoli.H61])=2                                AND                                          ([Calcoli.H61]-[.G7]>1)                                     AND                                          ([Calcoli.H61]-[.G7]<10);[Calcoli.H61];IF(MONTH([Calcoli.H77])=2                              AND                                          ([Calcoli.H77]-[.G7]>1)                                          AND                                          ([Calcoli.H77]-[.G7]<10);[Calcoli.H77];IF(MONTH([Calcoli.H93])=2                                          AND                                          ([Calcoli.H93]-[.G7]>1)                                  AND                                   ([Calcoli.H93]-[.G7]<10);[Calcoli.H93];IF(MONTH([Calcoli.H109])=2                                         AND                                         ([Calcoli.H109]-[.G7]>1)                                      AND                                         ([Calcoli.H109]-[.G7]<10);[Calcoli.H109];IF(MONTH([Calcoli.H169])=2                                         AND                                         ([Calcoli.H169]-[.G7]>1)                                      AND                                         ([Calcoli.H169]-[.G7]<10);[Calcoli.H169];IF(MONTH([Calcoli.H185])=2                                         AND                                         ([Calcoli.H185]-[.G7]>1)                                      AND                                         ([Calcoli.H185]-[.G7]<10);[Calcoli.H185];\"\")))))))","v":"2017-02-26"},{"$f":"of:=IF([.G8]=\"\";\"\";\"alle ore \")","v":"alle ore "},{"$f":"of:=IF([.G8]=[Calcoli.E217];TIME([Calcoli.E218];[Calcoli.E219];[Calcoli.E220]);IF([.G8]=[Calcoli.H61];TIME([Calcoli.H62];[Calcoli.H63];[Calcoli.H64]);IF([.G8]=[Calcoli.H77];TIME([Calcoli.HJ78];[Calcoli.H79];[Calcoli.H80]);IF([.G8]=[Calcoli.H93];TIME([Calcoli.H94];[Calcoli.H95];[Calcoli.H96]);IF([.G8]=[Calcoli.H109];TIME([Calcoli.H110];[Calcoli.H111];[Calcoli.H112]);IF([.G8]=[Calcoli.H169];TIME([Calcoli.H170];[Calcoli.H171];[Calcoli.H172]);IF([.G8]=[Calcoli.H185];TIME([Calcoli.H186];[Calcoli.H187];[Calcoli.H188]);\"\")))))))","v":"PT16H00M25S"},null,{"$f":"of:=IF([.L8]=\"\";\"\";IF([.K7]=\"L.N. \";\"P.Q. \";IF([.K7]=\"P.Q. \";\"L.P. \";IF([.K7]=\"L.P. \";\"U.Q. \";IF([.K7]=\"U.Q. \";\"L.N. \";\"\")))))","v":"L.N. "},{"$f":"of:=IF(MONTH([Calcoli.H217])=3                                     AND                                           ([Calcoli.H217]-[.L7]>1)                                  AND                                           ([Calcoli.H217]-[.L7]<10);[Calcoli.H217];IF(MONTH([Calcoli.K61])=3                                 AND                                           ([Calcoli.K61]-[.L7]>1)                                      AND                                           ([Calcoli.K61]-[.L7]<10);[Calcoli.K61];IF(MONTH([Calcoli.K77])=3                               AND                                           ([Calcoli.K77]-[.L7]>1)                                           AND                                           ([Calcoli.K77]-[.L7]<10);[Calcoli.K77];IF(MONTH([Calcoli.K93])=3                                           AND                                           ([Calcoli.K93]-[.L7]>1)                                   AND                                    ([Calcoli.K93]-[.L7]<10);[Calcoli.K93];IF(MONTH([Calcoli.K109])=3                                          AND                                          ([Calcoli.K109]-[.L7]>1)                                       AND                                          ([Calcoli.K109]-[.L7]<10);[Calcoli.K109];IF(MONTH([Calcoli.K169])=3                                          AND                                          ([Calcoli.K169]-[.L7]>1)                                       AND                                          ([Calcoli.K169]-[.L7]<10);[Calcoli.K169];IF(MONTH([Calcoli.K185])=3                                          AND                                          ([Calcoli.K185]-[.L7]>1)                                       AND                                          ([Calcoli.K185]-[.L7]<10);[Calcoli.K185];\"\")))))))","v":"2017-03-28"},{"$f":"of:=IF([.L8]=\"\";\"\";\"alle ore \")","v":"alle ore "},{"$f":"of:=IF([.L8]=[Calcoli.H217];TIME([Calcoli.H218];[Calcoli.H219];[Calcoli.H220]);IF([.L8]=[Calcoli.K61];TIME([Calcoli.K62];[Calcoli.K63];[Calcoli.K64]);IF([.L8]=[Calcoli.K77];TIME([Calcoli.K78];[Calcoli.K79];[Calcoli.K80]);IF([.L8]=[Calcoli.K93];TIME([Calcoli.K94];[Calcoli.K95];[Calcoli.K96]);IF([.L8]=[Calcoli.K109];TIME([Calcoli.K110];[Calcoli.K111];[Calcoli.K112]);IF([.L8]=[Calcoli.K169];TIME([Calcoli.K170];[Calcoli.K171];[Calcoli.K172]);IF([.L8]=[Calcoli.K185];TIME([Calcoli.K186];[Calcoli.K187];[Calcoli.K188]);\"\")))))))+IF([.G24]>=[Calcoli.B241];+TIME(0;0;0);+TIME(1;0;0))","v":"PT04H59M34S"},null,{"$f":"of:=IF([.Q8]=\"\";\"\";IF([.P7]=\"L.N. \";\"P.Q. \";IF([.P7]=\"P.Q. \";\"L.P. \";IF([.P7]=\"L.P. \";\"U.Q. \";IF([.P7]=\"U.Q. \";\"L.N. \";\"\")))))","v":"L.N. "},{"$f":"of:=IF(MONTH([Calcoli.K217])=4                                      AND                                            ([Calcoli.K217]-[.Q7]>1)                                   AND                                            ([Calcoli.K217]-[.Q7]<10);[Calcoli.K217];IF(MONTH([Calcoli.N61])=4                                  AND                                            ([Calcoli.N61]-[.Q7]>1)                                       AND                                            ([Calcoli.N61]-[.Q7]<10);[Calcoli.N61];IF(MONTH([Calcoli.N77])=4                                AND                                            ([Calcoli.N77]-[.Q7]>1)                                            AND                                            ([Calcoli.N77]-[.Q7]<10);[Calcoli.N77];IF(MONTH([Calcoli.N93])=4                                            AND                                            ([Calcoli.N93]-[.Q7]>1)                                    AND                                     ([Calcoli.N93]-[.Q7]<10);[Calcoli.N93];IF(MONTH([Calcoli.N109])=4                                           AND                                           ([Calcoli.N109]-[.Q7]>1)                                        AND                                           ([Calcoli.N109]-[.Q7]<10);[Calcoli.N109];IF(MONTH([Calcoli.N169])=4                                           AND                                           ([Calcoli.N169]-[.Q7]>1)                                        AND                                           ([Calcoli.N169]-[.Q7]<10);[Calcoli.N169];IF(MONTH([Calcoli.N185])=4                                           AND                                           ([Calcoli.N185]-[.Q7]>1)                                        AND                                           ([Calcoli.N185]-[.Q7]<10);[Calcoli.N185];\"\")))))))","v":"2017-04-26"},{"$f":"of:=IF([.Q8]=\"\";\"\";\"alle ore \")","v":"alle ore "},{"$f":"of:=IF([.Q8]=[Calcoli.K217];TIME([Calcoli.K218];[Calcoli.K219];[Calcoli.K220]);IF([.Q8]=[Calcoli.N61];TIME([Calcoli.N62];[Calcoli.N63];[Calcoli.N64]);IF([.Q8]=[Calcoli.N77];TIME([Calcoli.N78];[Calcoli.N79];[Calcoli.N80]);IF([.Q8]=[Calcoli.N93];TIME([Calcoli.N94];[Calcoli.N95];[Calcoli.N96]);IF([.Q8]=[Calcoli.N109];TIME([Calcoli.N110];[Calcoli.N111];[Calcoli.N112]);IF([.Q8]=[Calcoli.N169];TIME([Calcoli.N170];[Calcoli.N171];[Calcoli.N172]);IF([.Q8]=[Calcoli.N185];TIME([Calcoli.N186];[Calcoli.N187];[Calcoli.N188]);\"\")))))))+TIME(1;0;0)","v":"PT14H18M25S"}]
[{"$f":"of:=IF([.B9]=\"\";\"\";IF([.A8]=\"L.N. \";\"P.Q. \";IF([.A8]=\"P.Q. \";\"L.P. \";IF([.A8]=\"L.P. \";\"U.Q. \";IF([.A8]=\"U.Q. \";\"L.N. \";\"\")))))","v":null},{"$f":"of:=IF(MONTH([Calcoli.B217])=1                                     AND                                           ([Calcoli.B217]-[.B8]>1)                                  AND                                           ([Calcoli.B217]-[.B8]<10);[Calcoli.B217];IF(MONTH([Calcoli.E61])=1                                 AND                                           ([Calcoli.E61]-[.B8]>1)                                      AND                                           ([Calcoli.E61]-[.B8]<10);[Calcoli.E61];IF(MONTH([Calcoli.E77])=1                               AND                                           ([Calcoli.E77]-[.B8]>1)                                           AND                                           ([Calcoli.E77]-[.B8]<10);[Calcoli.E77];IF(MONTH([Calcoli.E93])=1                                           AND                                           ([Calcoli.E93]-[.B8]>1)                                   AND                                    ([Calcoli.E93]-[.B8]<10);[Calcoli.E93];IF(MONTH([Calcoli.E109])=1                                          AND                                          ([Calcoli.E109]-[.B8]>1)                                       AND                                          ([Calcoli.E109]-[.B8]<10);[Calcoli.E109];IF(MONTH([Calcoli.E169])=1                                          AND                                          ([Calcoli.E169]-[.B8]>1)                                       AND                                          ([Calcoli.E169]-[.B8]<10);[Calcoli.E169];IF(MONTH([Calcoli.E185])=1                                          AND                                          ([Calcoli.E185]-[.B8]>1)                                       AND                                          ([Calcoli.E185]-[.B8]<10);[Calcoli.E185];\"\")))))))","v":null},{"$f":"of:=IF([.B9]=\"\";\"\";\"alle ore \")","v":null},{"$f":"of:=IF([.B9]=[Calcoli.B217];TIME([Calcoli.B218];[Calcoli.B219];[Calcoli.B220]);IF([.B9]=[Calcoli.E61];TIME([Calcoli.E62];[Calcoli.E63];[Calcoli.E64]);IF([.B9]=[Calcoli.E77];TIME([Calcoli.E78];[Calcoli.E79];[Calcoli.E80]);IF([.B9]=[Calcoli.E93];TIME([Calcoli.E94];[Calcoli.E95];[Calcoli.E96]);IF([.B9]=[Calcoli.E109];TIME([Calcoli.E110];[Calcoli.E111];[Calcoli.E112]);IF([.B9]=[Calcoli.E169];TIME([Calcoli.E170];[Calcoli.E171];[Calcoli.E172]);IF([.B9]=[Calcoli.E185];TIME([Calcoli.E186];[Calcoli.E187];[Calcoli.E180]);\"\")))))))","v":null},null,{"$f":"of:=IF([.G9]=\"\";\"\";IF([.F8]=\"L.N. \";\"P.Q. \";IF([.F8]=\"P.Q. \";\"L.P. \";IF([.F8]=\"L.P. \";\"U.Q. \";IF([.F8]=\"U.Q. \";\"L.N. \";\"\")))))","v":null},null,{"$f":"of:=IF([.G9]=\"\";\"\";\"alle ore \")","v":null},null,null,{"$f":"of:=IF([.L9]=\"\";\"\";IF([.K8]=\"L.N. \";\"P.Q. \";IF([.K8]=\"P.Q. \";\"L.P. \";IF([.K8]=\"L.P. \";\"U.Q. \";IF([.K8]=\"U.Q. \";\"L.N. \";\"\")))))","v":null},{"$f":"of:=IF(MONTH([Calcoli.H217])=3                                       AND                                             ([Calcoli.H217]-[.L8]>1)                                    AND                                             ([Calcoli.H217]-[.L8]<10);[Calcoli.H217];IF(MONTH([Calcoli.K61])=3                                   AND                                             ([Calcoli.K61]-[.L8]>1)                                        AND                                             ([Calcoli.K61]-[.L8]<10);[Calcoli.K61];IF(MONTH([Calcoli.K77])=3                                 AND                                             ([Calcoli.K77]-[.L8]>1)                                             AND                                             ([Calcoli.K77]-[.L8]<10);[Calcoli.K77];IF(MONTH([Calcoli.K93])=3                                             AND                                             ([Calcoli.K93]-[.L8]>1)                                     AND                                      ([Calcoli.K93]-[.L8]<10);[Calcoli.K93];IF(MONTH([Calcoli.K109])=3                                            AND                                            ([Calcoli.K109]-[.L8]>1)                                         AND                                            ([Calcoli.K109]-[.L8]<10);[Calcoli.K109];IF(MONTH([Calcoli.K169])=3                                            AND                                            ([Calcoli.K169]-[.L8]>1)                                         AND                                            ([Calcoli.K169]-[.L8]<10);[Calcoli.K169];IF(MONTH([Calcoli.K185])=3                                            AND                                            ([Calcoli.K185]-[.L8]>1)                                         AND                                            ([Calcoli.K185]-[.L8]<10);[Calcoli.K185];\"\")))))))","v":null},{"$f":"of:=IF([.L9]=\"\";\"\";\"alle ore \")","v":null},{"$f":"of:=IF([.L9]=[Calcoli.H217];TIME([Calcoli.H218];[Calcoli.H219];[Calcoli.H220])+TIME(1;0;0);IF([.L9]=[Calcoli.K61];TIME([Calcoli.K62];[Calcoli.K63];[Calcoli.K64])+TIME(1;0;0);IF([.L9]=[Calcoli.K77];TIME([Calcoli.K78];[Calcoli.K79];[Calcoli.K80])+TIME(1;0;0);IF([.L9]=[Calcoli.K93];TIME([Calcoli.K94];[Calcoli.K95];[Calcoli.K96])+TIME(1;0;0);IF([.L9]=[Calcoli.K109];TIME([Calcoli.K110];[Calcoli.K111];[Calcoli.K112])+TIME(1;0;0);IF([.L9]=[Calcoli.K169];TIME([Calcoli.K170];[Calcoli.K171];[Calcoli.K172])+TIME(1;0;0);IF([.L9]=[Calcoli.K185];TIME([Calcoli.K186];[Calcoli.K187];[Calcoli.K188])+TIME(1;0;0);\"\")))))))","v":null},null,{"$f":"of:=IF([.Q9]=\"\";\"\";IF([.P8]=\"L.N. \";\"P.Q. \";IF([.P8]=\"P.Q. \";\"L.P. \";IF([.P8]=\"L.P. \";\"U.Q. \";IF([.P8]=\"U.Q. \";\"L.N. \";\"\")))))","v":null},{"$f":"of:=IF(MONTH([Calcoli.K217])=4                                       AND                                             ([Calcoli.K217]-[.Q8]>1)                                    AND                                             ([Calcoli.K217]-[.Q8]<10);[Calcoli.K217];IF(MONTH([Calcoli.N61])=4                                   AND                                             ([Calcoli.N61]-[.Q8]>1)                                        AND                                             ([Calcoli.N61]-[.Q8]<10);[Calcoli.N61];IF(MONTH([Calcoli.N77])=4                                 AND                                             ([Calcoli.N77]-[.Q8]>1)                                             AND                                             ([Calcoli.N77]-[.Q8]<10);[Calcoli.N77];IF(MONTH([Calcoli.N93])=4                                             AND                                             ([Calcoli.N93]-[.Q8]>1)                                     AND                                      ([Calcoli.N93]-[.Q8]<10);[Calcoli.N93];IF(MONTH([Calcoli.N109])=4                                            AND                                            ([Calcoli.N109]-[.Q8]>1)                                         AND                                            ([Calcoli.N109]-[.Q8]<10);[Calcoli.N109];IF(MONTH([Calcoli.N169])=4                                            AND                                            ([Calcoli.N169]-[.Q8]>1)                                         AND                                            ([Calcoli.N169]-[.Q8]<10);[Calcoli.N169];IF(MONTH([Calcoli.N185])=4                                            AND                                            ([Calcoli.N185]-[.Q8]>1)                                         AND                                            ([Calcoli.N185]-[.Q8]<10);[Calcoli.N185];\"\")))))))","v":null},{"$f":"of:=IF([.Q9]=\"\";\"\";\"alle ore \")","v":null},{"$f":"of:=IF([.Q9]=[Calcoli.K217];TIME([Calcoli.K218];[Calcoli.K219];[Calcoli.K220])+TIME(1;0;0);IF([.Q9]=[Calcoli.N61];TIME([Calcoli.N62];[Calcoli.N63];[Calcoli.N64])+TIME(1;0;0);IF([.Q9]=[Calcoli.N77];TIME([Calcoli.N78];[Calcoli.N79];[Calcoli.N80])+TIME(1;0;0);IF([.Q9]=[Calcoli.N93];TIME([Calcoli.N94];[Calcoli.N95];[Calcoli.N96])+TIME(1;0;0);IF([.Q9]=[Calcoli.N109];TIME([Calcoli.N110];[Calcoli.N111];[Calcoli.N112])+TIME(1;0;0);IF([.Q9]=[Calcoli.N169];TIME([Calcoli.N170];[Calcoli.N171];[Calcoli.N172])+TIME(1;0;0);IF([.Q9]=[Calcoli.N185];TIME([Calcoli.N186];[Calcoli.N187];[Calcoli.N188])+TIME(1;0;0);\"\")))))))","v":null}]
[]
[{"$f":"of:=IF([CALENDARY_MoonPhaase.B11]=\"\";\"\";\"L.P. \")","v":null},{"$f":"of:=IF(MONTH([Calcoli.H93])=1;[Calcoli.H93];\"\")","v":null},{"$f":"of:=IF([CALENDARY_MoonPhaase.B11]=\"\";\"\";\"alle ore \")","v":null},{"$f":"of:=IF([CALENDARY_MoonPhaase.B11]=\"\";\"\";TIME([Calcoli.H94];[Calcoli.H95];[Calcoli.H96]))","v":null},null,{"$f":"of:=IF([CALENDARY_MoonPhaase.G11]=\"\";\"\";\"L.P. \")","v":null},null,{"$f":"of:=IF([CALENDARY_MoonPhaase.G11]=\"\";\"\";\"alle ore \")","v":null},null,null,{"$f":"of:=IF([CALENDARY_MoonPhaase.L11]=\"\";\"\";\"L.P. \")","v":null},{"$f":"of:=IF(MONTH([Calcoli.N93])=3;[Calcoli.N93];\"\")","v":null},{"$f":"of:=IF([CALENDARY_MoonPhaase.L11]=\"\";\"\";\"alle ore \")","v":null},{"$f":"of:=IF([CALENDARY_MoonPhaase.L11]=\"\";\"\";TIME([Calcoli.N94]+1;[Calcoli.N95];[Calcoli.N96]))","v":null},null,{"$f":"of:=IF([CALENDARY_MoonPhaase.Q11]=\"\";\"\";\"L.P. \")","v":null}]
[{"$f":"of:=\"Maggio \"&YEAR([Calcoli.P4])","v":"Maggio 2017"},{"$nulls":4},{"$f":"of:=\"Giugno \"&YEAR([Calcoli.S4])","v":"Giugno 2017"},{"$nulls":4},{"$f":"of:=\"Luglio \"&YEAR([Calcoli.V4])","v":"Luglio 2017"},{"$nulls":4},{"$f":"of:=\"Agosto \"&YEAR([Calcoli.Y4])","v":"Agosto 2017"}]
[{"$f":"of:=IF([.B13]=[Calcoli.N169];\"L.N. \";IF([.B13]=[Calcoli.N185];\"P.Q. \";IF([.B13]=[Calcoli.N201];\"L.P. \";IF([.B13]=[Calcoli.N217];\"U.Q. \";IF([.B13]=[Calcoli.Q61];\"L.N. \";\"\")))))","v":"P.Q. "},{"$f":"of:=IF(MONTH([Calcoli.N169])=5;[Calcoli.N169];IF(MONTH([Calcoli.N185])=5;[Calcoli.N185];IF(MONTH([Calcoli.N201])=5;[Calcoli.N201];IF(MONTH([Calcoli.N217])=5;[Calcoli.N217];IF(MONTH([Calcoli.Q61])=5;[Calcoli.Q61];\"\")))))","v":"2017-05-03"},{"$f":"of:=IF([.B13]=\"\";\"\";\"alle ore \")","v":"alle ore "},{"$f":"of:=IF([.B13]=[Calcoli.N169];TIME([Calcoli.N170];[Calcoli.N171];0);IF([.B13]=[Calcoli.N185];TIME([Calcoli.N186];[Calcoli.N187];0);IF([.B13]=[Calcoli.N201];TIME([Calcoli.N202];[Calcoli.N203];0);IF([.B13]=[Calcoli.N217];TIME([Calcoli.N218];[Calcoli.N219];0);IF([.B13]=[Calcoli.Q61];TIME([Calcoli.Q62];[Calcoli.Q63];0);\"\")))))+TIME(1;0;0)","v":"PT04H44M00S"},null,{"$f":"of:=IF([.G13]=[Calcoli.Q169];\"L.N. \";IF([.G13]=[Calcoli.Q185];\"P.Q. \";IF([.G13]=[Calcoli.Q201];\"L.P. \";IF([.G13]=[Calcoli.Q217];\"U.Q. \";IF([.G13]=[Calcoli.T61];\"L.N. \";\"\")))))","v":"P.Q. "},{"$f":"of:=IF(MONTH([Calcoli.Q169])=6;[Calcoli.Q169];IF(MONTH([Calcoli.Q185])=6;[Calcoli.Q185];IF(MONTH([Calcoli.Q201])=6;[Calcoli.Q201];IF(MONTH([Calcoli.Q217])=6;[Calcoli.Q217];IF(MONTH([Calcoli.T61])=6;[Calcoli.T61];\"\")))))","v":"2017-06-01"},{"$f":"of:=IF([.G13]=\"\";\"\";\"alle ore \")","v":"alle ore "},{"$f":"of:=IF([.G13]=[Calcoli.Q169];TIME([Calcoli.Q170];[Calcoli.Q171];0);IF([.G13]=[Calcoli.Q185];TIME([Calcoli.Q186];[Calcoli.Q187];0);IF([.G13]=[Calcoli.Q201];TIME([Calcoli.Q202];[Calcoli.Q203];0);IF([.G13]=[Calcoli.Q217];TIME([Calcoli.Q218];[Calcoli.Q219];0);IF([.G13]=[Calcoli.T61];TIME([Calcoli.T62];[Calcoli.T63];0);\"\")))))+TIME(1;0;0)","v":"PT14H38M00S"},null,{"$f":"of:=IF([.L13]=[Calcoli.T169];\"L.N. \";IF([.L13]=[Calcoli.T185];\"P.Q. \";IF([.L13]=[Calcoli.T201];\"L.P. \";IF([.L13]=[Calcoli.T217];\"U.Q. \";IF([.L13]=[Calcoli.W61];\"L.N. \";\"\")))))","v":"P.Q. "},{"$f":"of:=IF(MONTH([Calcoli.T169])=7;[Calcoli.T169];IF(MONTH([Calcoli.T185])=7;[Calcoli.T185];IF(MONTH([Calcoli.T201])=7;[Calcoli.T201];IF(MONTH([Calcoli.T217])=7;[Calcoli.T217];IF(MONTH([Calcoli.W61])=7;[Calcoli.W61];\"\")))))","v":"2017-07-01"},{"$f":"of:=IF([.L13]=\"\";\"\";\"alle ore \")","v":"alle ore "},{"$f":"of:=IF([.L13]=[Calcoli.T169];TIME([Calcoli.T170];[Calcoli.T171];0);IF([.L13]=[Calcoli.T185];TIME([Calcoli.T186];[Calcoli.T187];0);IF([.L13]=[Calcoli.T201];TIME([Calcoli.T202];[Calcoli.T203];0);IF([.L13]=[Calcoli.T217];TIME([Calcoli.T218];[Calcoli.T219];0);IF([.L13]=[Calcoli.W61];TIME([Calcoli.W62];[Calcoli.W63];0);\"\")))))+TIME(1;0;0)","v":"PT02H47M00S"},null,{"$f":"of:=IF([.Q13]=[Calcoli.W169];\"L.N. \";IF([.Q13]=[Calcoli.W185];\"P.Q. \";IF([.Q13]=[Calcoli.W201];\"L.P. \";IF([.Q13]=[Calcoli.W217];\"U.Q. \";IF([.Q13]=[Calcoli.Z61];\"L.N. \";\"\")))))","v":"L.P. "},{"$f":"of:=IF(MONTH([Calcoli.W169])=8;[Calcoli.W169];IF(MONTH([Calcoli.W185])=8;[Calcoli.W185];IF(MONTH([Calcoli.W201])=8;[Calcoli.W201];IF(MONTH([Calcoli.W217])=8;[Calcoli.W217];IF(MONTH([Calcoli.Z61])=8;[Calcoli.Z61];\"\")))))","v":"2017-08-07"},{"$f":"of:=IF([.Q13]=\"\";\"\";\"alle ore \")","v":"alle ore "},{"$f":"of:=IF([.Q13]=[Calcoli.W169];TIME([Calcoli.W170];[Calcoli.W171];0);IF([.Q13]=[Calcoli.W185];TIME([Calcoli.W186];[Calcoli.W187];0);IF([.Q13]=[Calcoli.W201];TIME([Calcoli.W202];[Calcoli.W203];0);IF([.Q13]=[Calcoli.W217];TIME([Calcoli.W218];[Calcoli.W219];0);IF([.Q13]=[Calcoli.Z61];TIME([Calcoli.Z62];[Calcoli.Z63];0);\"\")))))+TIME(1;0;0)","v":"PT20H13M00S"}]
[{"$f":"of:=IF([.B14]=\"\";\"\";IF([.A13]=\"L.N. \";\"P.Q. \";IF([.A13]=\"P.Q. \";\"L.P. \";IF([.A13]=\"L.P. \";\"U.Q. \";IF([.A13]=\"U.Q. \";\"L.N. \";\"\")))))","v":"L.P. "},{"$f":"of:=IF(MONTH([Calcoli.N185])=5                                    AND                                          ([Calcoli.N185]-[.B13]>1)                                 AND                                          ([Calcoli.N185]-[.B13]<10);[Calcoli.N185];IF(MONTH([Calcoli.N201])=5                                AND                                          ([Calcoli.N201]-[.B13]>1)                                     AND                                          ([Calcoli.N201]-[.B13]<10);[Calcoli.N201];IF(MONTH([Calcoli.N217])=5                              AND                                          ([Calcoli.N217]-[.B13]>1)                                          AND                                          ([Calcoli.N217]-[.B13]<10);[Calcoli.N217];IF(MONTH([Calcoli.Q61])=5                                          AND                                          ([Calcoli.Q61]-[.B13]>1)                                  AND                                   ([Calcoli.Q61]-[.B13]<10);[Calcoli.Q61];IF(MONTH([Calcoli.Q77])=5                                         AND                                         ([Calcoli.Q77]-[.B13]>1)                                      AND                                         ([Calcoli.Q77]-[.B13]<10);[Calcoli.Q77];\"\")))))","v":"2017-05-10"},{"$f":"of:=IF([.B14]=\"\";\"\";\"alle ore \")","v":"alle ore "},{"$f":"of:=IF([.B14]=[Calcoli.N185];TIME([Calcoli.N186];[Calcoli.N187];0);IF([.B14]=[Calcoli.N201];TIME([Calcoli.N202];[Calcoli.N203];0);IF([.B14]=[Calcoli.N217];TIME([Calcoli.N218];[Calcoli.N219];0);IF([.B14]=[Calcoli.Q61];TIME([Calcoli.Q62];[Calcoli.Q63];0);IF([.B14]=[Calcoli.Q77];TIME([Calcoli.Q78];[Calcoli.Q79];0);\"\")))))+TIME(1;0;0)","v":"PT23H44M00S"},null,{"$f":"of:=IF([.G14]=\"\";\"\";IF([.F13]=\"L.N. \";\"P.Q. \";IF([.F13]=\"P.Q. \";\"L.P. \";IF([.F13]=\"L.P. \";\"U.Q. \";IF([.F13]=\"U.Q. \";\"L.N. \";\"\")))))","v":"L.P. "},{"$f":"of:=IF(MONTH([Calcoli.Q185])=6                                     AND                                           ([Calcoli.Q185]-[.G13]>1)                                  AND                                           ([Calcoli.Q185]-[.G13]<10);[Calcoli.Q185];IF(MONTH([Calcoli.Q201])=6                                 AND                                           ([Calcoli.Q201]-[.G13]>1)                                      AND                                           ([Calcoli.Q201]-[.G13]<10);[Calcoli.Q201];IF(MONTH([Calcoli.Q217])=6                               AND                                           ([Calcoli.Q217]-[.G13]>1)                                           AND                                           ([Calcoli.Q217]-[.G13]<10);[Calcoli.Q217];IF(MONTH([Calcoli.T61])=6                                           AND                                           ([Calcoli.T61]-[.G13]>1)                                   AND                                    ([Calcoli.T61]-[.G13]<10);[Calcoli.T61];IF(MONTH([Calcoli.T77])=6                                          AND                                          ([Calcoli.T77]-[.G13]>1)                                       AND                                          ([Calcoli.T77]-[.G13]<10);[Calcoli.T77];\"\")))))","v":"2017-06-09"},{"$f":"of:=IF([.G14]=\"\";\"\";\"alle ore \")","v":"alle ore "},{"$f":"of:=IF([.G14]=[Calcoli.Q185];TIME([Calcoli.Q186];[Calcoli.Q187];0);IF([.G14]=[Calcoli.Q201];TIME([Calcoli.Q202];[Calcoli.Q203];0);IF([.G14]=[Calcoli.Q217];TIME([Calcoli.Q218];[Calcoli.Q219];0);IF([.G14]=[Calcoli.T61];TIME([Calcoli.T62];[Calcoli.T63];0);IF([.G14]=[Calcoli.T77];TIME([Calcoli.T78];[Calcoli.T79];0);\"\")))))+TIME(1;0;0)","v":"PT15H11M00S"},null,{"$f":"of:=IF([.L14]=\"\";\"\";IF([.K13]=\"L.N. \";\"P.Q. \";IF([.K13]=\"P.Q. \";\"L.P. \";IF([.K13]=\"L.P. \";\"U.Q. \";IF([.K13]=\"U.Q. \";\"L.N. \";\"\")))))","v":"L.P. "},{"$f":"of:=IF(MONTH([Calcoli.T185])=7                                      AND                                            ([Calcoli.T185]-[.L13]>1)                                   AND                                            ([Calcoli.T185]-[.L13]<10);[Calcoli.T185];IF(MONTH([Calcoli.T201])=7                                  AND                                            ([Calcoli.T201]-[.L13]>1)                                       AND                                            ([Calcoli.T201]-[.L13]<10);[Calcoli.T201];IF(MONTH([Calcoli.T217])=7                                AND                                            ([Calcoli.T217]-[.L13]>1)                                            AND                                            ([Calcoli.T217]-[.L13]<10);[Calcoli.T217];IF(MONTH([Calcoli.W61])=7                                            AND                                            ([Calcoli.W61]-[.L13]>1)                                    AND                                     ([Calcoli.W61]-[.L13]<10);[Calcoli.W61];IF(MONTH([Calcoli.W77])=7                                           AND                                           ([Calcoli.W77]-[.L13]>1)                                        AND                                           ([Calcoli.W77]-[.L13]<10);[Calcoli.W77];\"\")))))","v":"2017-07-09"},{"$f":"of:=IF([.L14]=\"\";\"\";\"alle ore \")","v":"alle ore "},{"$f":"of:=IF([.L14]=[Calcoli.T185];TIME([Calcoli.T186];[Calcoli.T187];0);IF([.L14]=[Calcoli.T201];TIME([Calcoli.T202];[Calcoli.T203];0);IF([.L14]=[Calcoli.T217];TIME([Calcoli.T218];[Calcoli.T219];0);IF([.L14]=[Calcoli.W61];TIME([Calcoli.W62];[Calcoli.W63];0);IF([.L14]=[Calcoli.W77];TIME([Calcoli.W78];[Calcoli.W79];0);\"\")))))+TIME(1;0;0)","v":"PT06H08M00S"},null,{"$f":"of:=IF([.Q14]=\"\";\"\";IF([.P13]=\"L.N. \";\"P.Q. \";IF([.P13]=\"P.Q. \";\"L.P. \";IF([.P13]=\"L.P. \";\"U.Q. \";IF([.P13]=\"U.Q. \";\"L.N. \";\"\")))))","v":"U.Q. "},{"$f":"of:=IF(MONTH([Calcoli.W185])=8                                        AND                                              ([Calcoli.W185]-[.Q13]>1)                                     AND                                              ([Calcoli.W185]-[.Q13]<10);[Calcoli.W185];IF(MONTH([Calcoli.W201])=8                                    AND                                              ([Calcoli.W201]-[.Q13]>1)                                         AND                                              ([Calcoli.W201]-[.Q13]<10);[Calcoli.W201];IF(MONTH([Calcoli.W217])=8                                  AND                                              ([Calcoli.W217]-[.Q13]>1)                                              AND                                              ([Calcoli.W217]-[.Q13]<10);[Calcoli.W217];IF(MONTH([Calcoli.Z61])=8                                              AND                                              ([Calcoli.Z61]-[.Q13]>1)                                      AND                                       ([Calcoli.Z61]-[.Q13]<10);[Calcoli.Z61];IF(MONTH([Calcoli.Z77])=8                                             AND                                             ([Calcoli.Z77]-[.Q13]>1)                                          AND                                             ([Calcoli.Z77]-[.Q13]<10);[Calcoli.Z77];\"\")))))","v":"2017-08-15"},{"$f":"of:=IF([.Q14]=\"\";\"\";\"alle ore \")","v":"alle ore "},{"$f":"of:=IF([.Q14]=[Calcoli.W185];TIME([Calcoli.W186];[Calcoli.W187];0);IF([.Q14]=[Calcoli.W201];TIME([Calcoli.W202];[Calcoli.W203];0);IF([.Q14]=[Calcoli.W217];TIME([Calcoli.W218];[Calcoli.W219];0);IF([.Q14]=[Calcoli.Z61];TIME([Calcoli.Z62];[Calcoli.Z63];0);IF([.Q14]=[Calcoli.Z77];TIME([Calcoli.Z78];[Calcoli.Z79];0);\"\")))))+TIME(1;0;0)","v":"PT03H18M00S"}]
[{"$f":"of:=IF([.B15]=\"\";\"\";IF([.A14]=\"L.N. \";\"P.Q. \";IF([.A14]=\"P.Q. \";\"L.P. \";IF([.A14]=\"L.P. \";\"U.Q. \";IF([.A14]=\"U.Q. \";\"L.N. \";\"\")))))","v":"U.Q. "},{"$f":"of:=IF(MONTH([Calcoli.N201])=5                                    AND                                          ([Calcoli.N201]-[.B14]>1)                                 AND                                          ([Calcoli.N201]-[.B14]<10);[Calcoli.N201];IF(MONTH([Calcoli.N217])=5                                AND                                          ([Calcoli.N217]-[.B14]>1)                                     AND                                          ([Calcoli.N217]-[.B14]<10);[Calcoli.N217];IF(MONTH([Calcoli.Q61])=5                              AND                                          ([Calcoli.Q61]-[.B14]>1)                                          AND                                          ([Calcoli.Q61]-[.B14]<10);[Calcoli.Q61];IF(MONTH([Calcoli.Q77])=5                                          AND                                          ([Calcoli.Q77]-[.B14]>1)                                  AND                                   ([Calcoli.Q77]-[.B14]<10);[Calcoli.Q77];IF(MONTH([Calcoli.Q93])=5                                         AND                                         ([Calcoli.Q93]-[.B14]>1)                                      AND                                         ([Calcoli.Q93]-[.B14]<10);[Calcoli.Q93];IF(MONTH([Calcoli.Q109])=5                                         AND                                         ([Calcoli.Q109]-[.B14]>1)                                      AND                                         ([Calcoli.Q109]-[.B14]<10);[Calcoli.Q109];IF(MONTH([Calcoli.Q169])=5                                         AND                                         ([Calcoli.Q169]-[.B14]>1)                                      AND                                         ([Calcoli.Q169]-[.B14]<10);[Calcoli.Q169];\"\")))))))","v":"2017-05-19"},{"$f":"of:=IF([.B15]=\"\";\"\";\"alle ore \")","v":"alle ore "},{"$f":"of:=IF([.B15]=[Calcoli.N201];TIME([Calcoli.N202];[Calcoli.N203];0);IF([.B15]=[Calcoli.N217];TIME([Calcoli.N218];[Calcoli.N219];0);IF([.B15]=[Calcoli.Q61];TIME([Calcoli.Q62];[Calcoli.Q63];0);IF([.B15]=[Calcoli.Q77];TIME([Calcoli.Q78];[Calcoli.Q79];0);IF([.B15]=[Calcoli.Q93];TIME([Calcoli.Q94];[Calcoli.Q95];0);IF([.B15]=[Calcoli.Q109];TIME([Calcoli.Q110];[Calcoli.Q111];0);IF([.B15]=[Calcoli.Q169];TIME([Calcoli.Q170];[Calcoli.Q171];0);\"\")))))))+TIME(1;0;0)","v":"PT02H36M00S"},null,{"$f":"of:=IF([.G15]=\"\";\"\";IF([.F14]=\"L.N. \";\"P.Q. \";IF([.F14]=\"P.Q. \";\"L.P. \";IF([.F14]=\"L.P. \";\"U.Q. \";IF([.F14]=\"U.Q. \";\"L.N. \";\"\")))))","v":"U.Q. "},{"$f":"of:=IF(MONTH([Calcoli.Q201])=6                                     AND                                           ([Calcoli.Q201]-[.G14]>1)                                  AND                                           ([Calcoli.Q201]-[.G14]<10);[Calcoli.Q201];IF(MONTH([Calcoli.Q217])=6                                 AND                                           ([Calcoli.Q217]-[.G14]>1)                                      AND                                           ([Calcoli.Q217]-[.G14]<10);[Calcoli.Q217];IF(MONTH([Calcoli.T61])=6                               AND                                           ([Calcoli.T61]-[.G14]>1)                                           AND                                           ([Calcoli.T61]-[.G14]<10);[Calcoli.T61];IF(MONTH([Calcoli.T77])=6                                           AND                                           ([Calcoli.T77]-[.G14]>1)                                   AND                                    ([Calcoli.T77]-[.G14]<10);[Calcoli.T77];IF(MONTH([Calcoli.T93])=6                                          AND                                          ([Calcoli.T93]-[.G14]>1)                                       AND                                          ([Calcoli.T93]-[.G14]<10);[Calcoli.T93];IF(MONTH([Calcoli.T109])=6                                          AND                                          ([Calcoli.T109]-[.G14]>1)                                       AND                                          ([Calcoli.T109]-[.G14]<10);[Calcoli.T109];IF(MONTH([Calcoli.T169])=6                                          AND                                          ([Calcoli.T169]-[.G14]>1)                                       AND                                          ([Calcoli.T169]-[.G14]<10);[Calcoli.T169];\"\")))))))","v":"2017-06-17"},{"$f":"of:=IF([.G15]=\"\";\"\";\"alle ore \")","v":"alle ore "},{"$f":"of:=IF([.G15]=[Calcoli.Q201];TIME([Calcoli.Q202];[Calcoli.Q203];0);IF([.G15]=[Calcoli.Q217];TIME([Calcoli.Q218];[Calcoli.Q219];0);IF([.G15]=[Calcoli.T61];TIME([Calcoli.T62];[Calcoli.T63];0);IF([.G15]=[Calcoli.T77];TIME([Calcoli.T78];[Calcoli.T79];0);IF([.G15]=[Calcoli.T93];TIME([Calcoli.T94];[Calcoli.T95];0);IF([.G15]=[Calcoli.T109];TIME([Calcoli.T110];[Calcoli.T111];0);IF([.G15]=[Calcoli.T169];TIME([Calcoli.T170];[Calcoli.T171];0);\"\")))))))+TIME(1;0;0)","v":"PT13H35M00S"},null,{"$f":"of:=IF([.L15]=\"\";\"\";IF([.K14]=\"L.N. \";\"P.Q. \";IF([.K14]=\"P.Q. \";\"L.P. \";IF([.K14]=\"L.P. \";\"U.Q. \";IF([.K14]=\"U.Q. \";\"L.N. \";\"\")))))","v":"U.Q. "},{"$f":"of:=IF(MONTH([Calcoli.T201])=7                                   AND                                             ([Calcoli.T201]-[.L14]>1)                                        AND                                             ([Calcoli.T201]-[.L14]<10);[Calcoli.T201];IF(MONTH([Calcoli.T217])=7                                 AND                                             ([Calcoli.T217]-[.L14]>1)                                             AND                                             ([Calcoli.T217]-[.L14]<10);[Calcoli.T217];IF(MONTH([Calcoli.W61])=7                                             AND                                             ([Calcoli.W61]-[.L14]>1)                                     AND                                      ([Calcoli.W61]-[.L14]<10);[Calcoli.W61];IF(MONTH([Calcoli.W77])=7                                            AND                                            ([Calcoli.W77]-[.L14]>1)                                         AND                                            ([Calcoli.W77]-[.L14]<10);[Calcoli.W77];IF(MONTH([Calcoli.W93])=7                                       AND                                             ([Calcoli.W93]-[.L14]>1)                                    AND                                             ([Calcoli.W93]-[.L14]<10);[Calcoli.W93];IF(MONTH([Calcoli.W109])=7                                       AND                                             ([Calcoli.W109]-[.L14]>1)                                    AND                                             ([Calcoli.W109]-[.L14]<10);[Calcoli.W109];IF(MONTH([Calcoli.W169])=7                                       AND                                             ([Calcoli.W169]-[.L14]>1)                                    AND                                             ([Calcoli.W169]-[.L14]<10);[Calcoli.W169];\"\")))))))","v":"2017-07-16"},{"$f":"of:=IF([.L15]=\"\";\"\";\"alle ore \")","v":"alle ore "},{"$f":"of:=IF([.L15]=[Calcoli.T201];TIME([Calcoli.T202];[Calcoli.T203];0);IF([.L15]=[Calcoli.T217];TIME([Calcoli.T218];[Calcoli.T219];0);IF([.L15]=[Calcoli.W61];TIME([Calcoli.W62];[Calcoli.EW63];0);IF([.L15]=[Calcoli.W77];TIME([Calcoli.W78];[Calcoli.W79];0);IF([.L15]=[Calcoli.W93];TIME([Calcoli.W94];[Calcoli.W95];0);IF([.L15]=[Calcoli.W109];TIME([Calcoli.W110];[Calcoli.W111];0);IF([.L15]=[Calcoli.W169];TIME([Calcoli.W170];[Calcoli.W171];0);\"\")))))))+TIME(1;0;0)","v":"PT21H28M00S"},null,{"$f":"of:=IF([.Q15]=\"\";\"\";IF([.P14]=\"L.N. \";\"P.Q. \";IF([.P14]=\"P.Q. \";\"L.P. \";IF([.P14]=\"L.P. \";\"U.Q. \";IF([.P14]=\"U.Q. \";\"L.N. \";\"\")))))","v":"L.N. "},{"$f":"of:=IF(MONTH([Calcoli.W201])=8                                    AND                                              ([Calcoli.W201]-[.Q14]>1)                                         AND                                              ([Calcoli.W201]-[.Q14]<10);[Calcoli.W201];IF(MONTH([Calcoli.W217])=8                                  AND                                              ([Calcoli.W217]-[.Q14]>1)                                              AND                                              ([Calcoli.W217]-[.Q14]<10);[Calcoli.W217];IF(MONTH([Calcoli.Z61])=8                                              AND                                              ([Calcoli.Z61]-[.Q14]>1)                                      AND                                       ([Calcoli.Z61]-[.Q14]<10);[Calcoli.Z61];IF(MONTH([Calcoli.Z77])=8                                             AND                                             ([Calcoli.Z77]-[.Q14]>1)                                          AND                                             ([Calcoli.Z77]-[.Q14]<10);[Calcoli.Z77];IF(MONTH([Calcoli.Z93])=8                                        AND                                              ([Calcoli.Z93]-[.Q14]>1)                                     AND                                              ([Calcoli.Z93]-[.Q14]<10);[Calcoli.Z93];IF(MONTH([Calcoli.Z109])=8                                        AND                                              ([Calcoli.Z109]-[.Q14]>1)                                     AND                                              ([Calcoli.Z109]-[.Q14]<10);[Calcoli.Z109];IF(MONTH([Calcoli.Z169])=8                                        AND                                              ([Calcoli.Z169]-[.Q14]>1)                                     AND                                              ([Calcoli.Z169]-[.Q14]<10);[Calcoli.Z169];\"\")))))))","v":"2017-08-21"},{"$f":"of:=IF([.Q15]=\"\";\"\";\"alle ore \")","v":"alle ore "},{"$f":"of:=IF([.Q15]=[Calcoli.W201];TIME([Calcoli.W202];[Calcoli.W203];0);IF([.Q15]=[Calcoli.W217];TIME([Calcoli.W218];[Calcoli.W219];0);IF([.Q15]=[Calcoli.Z61];TIME([Calcoli.Z62];[Calcoli.Z63];0);IF([.Q15]=[Calcoli.Z77];TIME([Calcoli.Z78];[Calcoli.Z79];0);IF([.Q15]=[Calcoli.Z93];TIME([Calcoli.Z94];[Calcoli.Z95];0);IF([.Q15]=[Calcoli.Z109];TIME([Calcoli.Z110];[Calcoli.Z111];0);IF([.Q15]=[Calcoli.Z169];TIME([Calcoli.Z170];[Calcoli.Z171];0);\"\")))))))+TIME(1;0;0)","v":"PT20H31M00S"}]
[{"$f":"of:=IF([.B16]=\"\";\"\";IF([.A15]=\"L.N. \";\"P.Q. \";IF([.A15]=\"P.Q. \";\"L.P. \";IF([.A15]=\"L.P. \";\"U.Q. \";IF([.A15]=\"U.Q. \";\"L.N. \";\"\")))))","v":"L.N. "},{"$f":"of:=IF(MONTH([Calcoli.N217])=5                                    AND                                          ([Calcoli.N217]-[.B15]>1)                                 AND                                          ([Calcoli.N217]-[.B15]<10);[Calcoli.N217];IF(MONTH([Calcoli.Q61])=5                                AND                                          ([Calcoli.Q61]-[.B15]>1)                                     AND                                          ([Calcoli.Q61]-[.B15]<10);[Calcoli.Q61];IF(MONTH([Calcoli.Q77])=5                              AND                                          ([Calcoli.Q77]-[.B15]>1)                                          AND                                          ([Calcoli.Q77]-[.B15]<10);[Calcoli.Q77];IF(MONTH([Calcoli.Q93])=5                                          AND                                          ([Calcoli.Q93]-[.B15]>1)                                  AND                                   ([Calcoli.Q93]-[.B15]<10);[Calcoli.Q93];IF(MONTH([Calcoli.Q109])=5                                         AND                                         ([Calcoli.Q109]-[.B15]>1)                                      AND                                         ([Calcoli.Q109]-[.B15]<10);[Calcoli.Q109];IF(MONTH([Calcoli.Q169])=5                                         AND                                         ([Calcoli.Q169]-[.B15]>1)                                      AND                                         ([Calcoli.Q169]-[.B15]<10);[Calcoli.Q169];IF(MONTH([Calcoli.Q185])=5                                         AND                                         ([Calcoli.Q185]-[.B15]>1)                                      AND                                         ([Calcoli.Q185]-[.B15]<10);[Calcoli.Q185];\"\")))))))","v":"2017-05-25"},{"$f":"of:=IF([.B16]=\"\";\"\";\"alle ore \")","v":"alle ore "},{"$f":"of:=IF([.B16]=[Calcoli.N217];TIME([Calcoli.N218];[Calcoli.N219];0);IF([.B16]=[Calcoli.Q61];TIME([Calcoli.Q62];[Calcoli.Q63];0);IF([.B16]=[Calcoli.Q77];TIME([Calcoli.Q78];[Calcoli.Q79];0);IF([.B16]=[Calcoli.Q93];TIME([Calcoli.Q94];[Calcoli.Q95];0);IF([.B16]=[Calcoli.Q109];TIME([Calcoli.Q110];[Calcoli.Q111];0);IF([.B16]=[Calcoli.Q169];TIME([Calcoli.Q170];[Calcoli.Q171];0);IF([.B16]=[Calcoli.Q185];TIME([Calcoli.Q186];[Calcoli.Q187];0);\"\")))))))+TIME(1;0;0)","v":"PT21H46M00S"},null,{"$f":"of:=IF([.G16]=\"\";\"\";IF([.F15]=\"L.N. \";\"P.Q. \";IF([.F15]=\"P.Q. \";\"L.P. \";IF([.F15]=\"L.P. \";\"U.Q. \";IF([.F15]=\"U.Q. \";\"L.N. \";\"\")))))","v":"L.N. "},{"$f":"of:=IF(MONTH([Calcoli.Q217])=6                                     AND                                           ([Calcoli.Q217]-[.G15]>1)                                  AND                                           ([Calcoli.Q217]-[.G15]<10);[Calcoli.Q217];IF(MONTH([Calcoli.T61])=6                                 AND                                           ([Calcoli.T61]-[.G15]>1)                                      AND                                           ([Calcoli.T61]-[.G15]<10);[Calcoli.T61];IF(MONTH([Calcoli.T77])=6                               AND                                           ([Calcoli.T77]-[.G15]>1)                                           AND                                           ([Calcoli.T77]-[.G15]<10);[Calcoli.T77];IF(MONTH([Calcoli.T93])=6                                           AND                                           ([Calcoli.T93]-[.G15]>1)                                   AND                                    ([Calcoli.T93]-[.G15]<10);[Calcoli.T93];IF(MONTH([Calcoli.T109])=6                                          AND                                          ([Calcoli.T109]-[.G15]>1)                                       AND                                          ([Calcoli.T109]-[.G15]<10);[Calcoli.T109];IF(MONTH([Calcoli.T169])=6                                          AND                                          ([Calcoli.T169]-[.G15]>1)                                       AND                                          ([Calcoli.T169]-[.G15]<10);[Calcoli.T169];IF(MONTH([Calcoli.T185])=6                                          AND                                          ([Calcoli.T185]-[.G15]>1)                                       AND                                          ([Calcoli.T185]-[.G15]<10);[Calcoli.T185];\"\")))))))","v":"2017-06-24"},{"$f":"of:=IF([.G16]=\"\";\"\";\"alle ore \")","v":"alle ore "},{"$f":"of:=IF([.G16]=[Calcoli.Q217];TIME([Calcoli.Q218];[Calcoli.Q219];0);IF([.G16]=[Calcoli.T61];TIME([Calcoli.T62];[Calcoli.T63];0);IF([.G16]=[Calcoli.T77];TIME([Calcoli.T78];[Calcoli.T79];0);IF([.G16]=[Calcoli.T93];TIME([Calcoli.T94];[Calcoli.T95];0);IF([.G16]=[Calcoli.T109];TIME([Calcoli.T110];[Calcoli.T111];0);IF([.G16]=[Calcoli.T169];TIME([Calcoli.T170];[Calcoli.T171];0);IF([.G16]=[Calcoli.T185];TIME([Calcoli.T186];[Calcoli.T187];0);\"\")))))))+TIME(1;0;0)","v":"PT04H33M00S"},null,{"$f":"of:=IF([.L16]=\"\";\"\";IF([.K15]=\"L.N. \";\"P.Q. \";IF([.K15]=\"P.Q. \";\"L.P. \";IF([.K15]=\"L.P. \";\"U.Q. \";IF([.K15]=\"U.Q. \";\"L.N. \";\"\")))))","v":"L.N. "},{"$f":"of:=IF(MONTH([Calcoli.T217])=7                                        AND                                              ([Calcoli.T217]-[.L15]>1)                                     AND                                              ([Calcoli.T217]-[.L15]<10);[Calcoli.T217];IF(MONTH([Calcoli.W61])=7                                    AND                                              ([Calcoli.W61]-[.L15]>1)                                         AND                                              ([Calcoli.W61]-[.L15]<10);[Calcoli.W61];IF(MONTH([Calcoli.W77])=7                                  AND                                              ([Calcoli.W77]-[.L15]>1)                                              AND                                              ([Calcoli.W77]-[.L15]<10);[Calcoli.W77];IF(MONTH([Calcoli.W93])=7                                              AND                                              ([Calcoli.W93]-[.L15]>1)                                      AND                                       ([Calcoli.W93]-[.L15]<10);[Calcoli.W93];IF(MONTH([Calcoli.W109])=7                                             AND                                             ([Calcoli.W109]-[.L15]>1)                                          AND                                             ([Calcoli.W109]-[.L15]<10);[Calcoli.W109];IF(MONTH([Calcoli.W169])=7                                             AND                                             ([Calcoli.W169]-[.L15]>1)                                          AND                                             ([Calcoli.W169]-[.L15]<10);[Calcoli.W169];IF(MONTH([Calcoli.W185])=7                                             AND                                             ([Calcoli.W185]-[.L15]>1)                                          AND                                             ([Calcoli.W185]-[.L15]<10);[Calcoli.W185];\"\")))))))","v":"2017-07-23"},{"$f":"of:=IF([.L16]=\"\";\"\";\"alle ore \")","v":"alle ore "},{"$f":"of:=IF([.L16]=[Calcoli.T217];TIME([Calcoli.T218];[Calcoli.T219];0);IF([.L16]=[Calcoli.W61];TIME([Calcoli.W62];[Calcoli.W63];0);IF([.L16]=[Calcoli.W77];TIME([Calcoli.W78];[Calcoli.W79];0);IF([.L16]=[Calcoli.W93];TIME([Calcoli.W94];[Calcoli.W95];0);IF([.L16]=[Calcoli.W109];TIME([Calcoli.W110];[Calcoli.W111];0);IF([.L16]=[Calcoli.W169];TIME([Calcoli.W170];[Calcoli.W171];0);IF([.L16]=[Calcoli.W185];TIME([Calcoli.W186];[Calcoli.W187];0);\"\")))))))+TIME(1;0;0)","v":"PT11H47M00S"},null,{"$f":"of:=IF([.Q16]=\"\";\"\";IF([.P15]=\"L.N. \";\"P.Q. \";IF([.P15]=\"P.Q. \";\"L.P. \";IF([.P15]=\"L.P. \";\"U.Q. \";IF([.P15]=\"U.Q. \";\"L.N. \";\"\")))))","v":"P.Q. "},{"$f":"of:=IF(MONTH([Calcoli.W217])=8                                       AND                                             ([Calcoli.W217]-[.Q15]>1)                                    AND                                             ([Calcoli.W217]-[.Q15]<10);[Calcoli.W217];IF(MONTH([Calcoli.Z61])=8                                   AND                                             ([Calcoli.Z61]-[.Q15]>1)                                        AND                                             ([Calcoli.Z61]-[.Q15]<10);[Calcoli.Z61];IF(MONTH([Calcoli.Z77])=8                                 AND                                             ([Calcoli.Z77]-[.Q15]>1)                                             AND                                             ([Calcoli.Z77]-[.Q15]<10);[Calcoli.Z77];IF(MONTH([Calcoli.Z93])=8                                             AND                                             ([Calcoli.Z93]-[.Q15]>1)                                     AND                                      ([Calcoli.Z93]-[.Q15]<10);[Calcoli.Z93];IF(MONTH([Calcoli.Z109])=8                                            AND                                            ([Calcoli.Z109]-[.Q15]>1)                                         AND                                            ([Calcoli.Z109]-[.Q15]<10);[Calcoli.Z109];IF(MONTH([Calcoli.Z169])=8                                            AND                                            ([Calcoli.Z169]-[.Q15]>1)                                         AND                                            ([Calcoli.Z169]-[.Q15]<10);[Calcoli.Z169];IF(MONTH([Calcoli.Z185])=8                                            AND                                            ([Calcoli.Z185]-[.Q15]>1)                                         AND                                            ([Calcoli.Z185]-[.Q15]<10);[Calcoli.Z185];\"\")))))))","v":"2017-08-29"},{"$f":"of:=IF([.Q16]=\"\";\"\";\"alle ore \")","v":"alle ore "},{"$f":"of:=IF([.Q16]=[Calcoli.W217];TIME([Calcoli.W218];[Calcoli.W219];0);IF([.Q16]=[Calcoli.Z61];TIME([Calcoli.Z62];[Calcoli.Z63];0);IF([.Q16]=[Calcoli.Z77];TIME([Calcoli.Z78];[Calcoli.Z79];0);IF([.Q16]=[Calcoli.Z93];TIME([Calcoli.Z94];[Calcoli.Z95];0);IF([.Q16]=[Calcoli.Z109];TIME([Calcoli.Z110];[Calcoli.Z111];0);IF([.Q16]=[Calcoli.Z169];TIME([Calcoli.Z170];[Calcoli.Z171];0);IF([.Q16]=[Calcoli.Z185];TIME([Calcoli.Z186];[Calcoli.Z187];0);\"\")))))))+TIME(1;0;0)","v":"PT10H10M00S"}]
[{"$f":"of:=IF([.B17]=\"\";\"\";IF([.A16]=\"L.N. \";\"P.Q. \";IF([.A16]=\"P.Q. \";\"L.P. \";IF([.A16]=\"L.P. \";\"U.Q. \";IF([.A16]=\"U.Q. \";\"L.N. \";\"\")))))","v":null},{"$f":"of:=IF(MONTH([Calcoli.N217])=5                                      AND                                            ([Calcoli.N217]-[.B16]>1)                                   AND                                            ([Calcoli.N217]-[.B16]<10);[Calcoli.N217];IF(MONTH([Calcoli.Q61])=5                                  AND                                            ([Calcoli.Q61]-[.B16]>1)                                       AND                                            ([Calcoli.Q61]-[.B16]<10);[Calcoli.Q61];IF(MONTH([Calcoli.Q77])=5                                AND                                            ([Calcoli.Q77]-[.B16]>1)                                            AND                                            ([Calcoli.Q77]-[.B16]<10);[Calcoli.Q77];IF(MONTH([Calcoli.Q93])=5                                            AND                                            ([Calcoli.Q93]-[.B16]>1)                                    AND                                     ([Calcoli.Q93]-[.B16]<10);[Calcoli.Q93];IF(MONTH([Calcoli.Q109])=5                                           AND                                           ([Calcoli.Q109]-[.B16]>1)                                        AND                                           ([Calcoli.Q109]-[.B16]<10);[Calcoli.Q109];IF(MONTH([Calcoli.Q169])=5                                           AND                                           ([Calcoli.Q169]-[.B16]>1)                                        AND                                           ([Calcoli.Q169]-[.B16]<10);[Calcoli.Q169];IF(MONTH([Calcoli.Q185])=5                                           AND                                           ([Calcoli.Q185]-[.B16]>1)                                        AND                                           ([Calcoli.Q185]-[.B16]<10);[Calcoli.Q185];\"\")))))))","v":null},{"$f":"of:=IF([.B17]=\"\";\"\";\"alle ore \")","v":null},{"$f":"of:=IF([.B17]=[Calcoli.N217];TIME([Calcoli.N218];[Calcoli.N219];0+TIME(1;0;0));IF([.B17]=[Calcoli.Q61];TIME([Calcoli.Q62];[Calcoli.Q63];0)+TIME(1;0;0);IF([.B17]=[Calcoli.Q77];TIME([Calcoli.Q78];[Calcoli.Q79];0)+TIME(1;0;0);IF([.B17]=[Calcoli.Q93];TIME([Calcoli.Q94];[Calcoli.Q95];0)+TIME(1;0;0);IF([.B17]=[Calcoli.Q109];TIME([Calcoli.Q110];[Calcoli.Q111];0)+TIME(1;0;0);IF([.B17]=[Calcoli.Q169];TIME([Calcoli.Q170];[Calcoli.Q171];0)+TIME(1;0;0);IF([.B17]=[Calcoli.Q185];TIME([Calcoli.Q186];[Calcoli.Q187];0)+TIME(1;0;0);\"\")))))))","v":null},null,{"$f":"of:=IF([.G17]=\"\";\"\";IF([.F16]=\"L.N. \";\"P.Q. \";IF([.F16]=\"P.Q. \";\"L.P. \";IF([.F16]=\"L.P. \";\"U.Q. \";IF([.F16]=\"U.Q. \";\"L.N. \";\"\")))))","v":null},{"$f":"of:=IF(MONTH([Calcoli.Q217])=6                                      AND                                            ([Calcoli.Q217]-[.G16]>1)                                   AND                                            ([Calcoli.Q217]-[.G16]<10);[Calcoli.Q217];IF(MONTH([Calcoli.T61])=6                                  AND                                            ([Calcoli.T61]-[.G16]>1)                                       AND                                            ([Calcoli.T61]-[.G16]<10);[Calcoli.T61];IF(MONTH([Calcoli.T77])=6                                AND                                            ([Calcoli.T77]-[.G16]>1)                                            AND                                            ([Calcoli.T77]-[.G16]<10);[Calcoli.T77];IF(MONTH([Calcoli.T93])=6                                            AND                                            ([Calcoli.T93]-[.G16]>1)                                    AND                                     ([Calcoli.T93]-[.G16]<10);[Calcoli.T93];IF(MONTH([Calcoli.T109])=6                                           AND                                           ([Calcoli.T109]-[.G16]>1)                                        AND                                           ([Calcoli.T109]-[.G16]<10);[Calcoli.T109];IF(MONTH([Calcoli.T169])=6                                           AND                                           ([Calcoli.T169]-[.G16]>1)                                        AND                                           ([Calcoli.T169]-[.G16]<10);[Calcoli.T169];IF(MONTH([Calcoli.T185])=6                                           AND                                           ([Calcoli.T185]-[.G16]>1)                                        AND                                           ([Calcoli.T185]-[.G16]<10);[Calcoli.T185];\"\")))))))","v":null},{"$f":"of:=IF([.G17]=\"\";\"\";\"alle ore \")","v":null},{"$f":"of:=IF([.G17]=[Calcoli.Q217];TIME([Calcoli.Q218];[Calcoli.Q219];0)+TIME(1;0;0);IF([.G17]=[Calcoli.T61];TIME([Calcoli.T62];[Calcoli.T63];0)+TIME(1;0;0);IF([.G17]=[Calcoli.T77];TIME([Calcoli.T78];[Calcoli.T79];0)+TIME(1;0;0);IF([.G17]=[Calcoli.T93];TIME([Calcoli.T94];[Calcoli.T95];0)+TIME(1;0;0);IF([.G17]=[Calcoli.T109];TIME([Calcoli.T110];[Calcoli.T111];0)+TIME(1;0;0);IF([.G17]=[Calcoli.T169];TIME([Calcoli.T170];[Calcoli.T171];0)+TIME(1;0;0);IF([.G17]=[Calcoli.T185];TIME([Calcoli.T186];[Calcoli.T187];0)+TIME(1;0;0);\"\")))))))","v":null},null,{"$f":"of:=IF([.L17]=\"\";\"\";IF([.K16]=\"L.N. \";\"P.Q. \";IF([.K16]=\"P.Q. \";\"L.P. \";IF([.K16]=\"L.P. \";\"U.Q. \";IF([.K16]=\"U.Q. \";\"L.N. \";\"\")))))","v":"P.Q. "},{"$f":"of:=IF(MONTH([Calcoli.T217])=7                                        AND                                              ([Calcoli.T217]-[.L16]>1)                                     AND                                              ([Calcoli.T217]-[.L16]<10);[Calcoli.T217];IF(MONTH([Calcoli.W61])=7                                    AND                                              ([Calcoli.W61]-[.L16]>1)                                         AND                                              ([Calcoli.W61]-[.L16]<10);[Calcoli.W61];IF(MONTH([Calcoli.W77])=7                                  AND                                              ([Calcoli.W77]-[.L16]>1)                                              AND                                              ([Calcoli.W77]-[.L16]<10);[Calcoli.W77];IF(MONTH([Calcoli.W93])=7                                              AND                                              ([Calcoli.W93]-[.L16]>1)                                      AND                                       ([Calcoli.W93]-[.L16]<10);[Calcoli.W93];IF(MONTH([Calcoli.W109])=7                                             AND                                             ([Calcoli.W109]-[.L16]>1)                                          AND                                             ([Calcoli.W109]-[.L16]<10);[Calcoli.W109];IF(MONTH([Calcoli.W169])=7                                             AND                                             ([Calcoli.W169]-[.L16]>1)                                          AND                                             ([Calcoli.W169]-[.L16]<10);[Calcoli.W169];IF(MONTH([Calcoli.W185])=7                                             AND                                             ([Calcoli.W185]-[.L16]>1)                                          AND                                             ([Calcoli.W185]-[.L16]<10);[Calcoli.W185];\"\")))))))","v":"2017-07-30"},{"$f":"of:=IF([.L17]=\"\";\"\";\"alle ore \")","v":"alle ore "},{"$f":"of:=IF([.L17]=[Calcoli.T217];TIME([Calcoli.T218];[Calcoli.T219];0)+TIME(1;0;0);IF([.L17]=[Calcoli.W61];TIME([Calcoli.W62];[Calcoli.W63];0)+TIME(1;0;0);IF([.L17]=[Calcoli.W77];TIME([Calcoli.W78];[Calcoli.W79];0)+TIME(1;0;0);IF([.L17]=[Calcoli.W93];TIME([Calcoli.W94];[Calcoli.W95];0)+TIME(1;0;0);IF([.L17]=[Calcoli.W109];TIME([Calcoli.W110];[Calcoli.W111];0)+TIME(1;0;0);IF([.L17]=[Calcoli.W169];TIME([Calcoli.W170];[Calcoli.W171];0)+TIME(1;0;0);IF([.L17]=[Calcoli.W185];TIME([Calcoli.W186];[Calcoli.W187];0)+TIME(1;0;0);\"\")))))))","v":"PT17H20M00S"},null,{"$f":"of:=IF([.Q17]=\"\";\"\";IF([.P16]=\"L.N. \";\"P.Q. \";IF([.P16]=\"P.Q. \";\"L.P. \";IF([.P16]=\"L.P. \";\"U.Q. \";IF([.P16]=\"U.Q. \";\"L.N. \";\"\")))))","v":null},{"$f":"of:=IF(MONTH([Calcoli.W217])=8                                        AND                                              ([Calcoli.W217]-[.Q16]>1)                                     AND                                              ([Calcoli.W217]-[.Q16]<10);[Calcoli.W217];IF(MONTH([Calcoli.Z61])=8                                    AND                                              ([Calcoli.Z61]-[.Q16]>1)                                         AND                                              ([Calcoli.Z61]-[.Q16]<10);[Calcoli.Z61];IF(MONTH([Calcoli.Z77])=8                                  AND                                              ([Calcoli.Z77]-[.Q16]>1)                                              AND                                              ([Calcoli.Z77]-[.Q16]<10);[Calcoli.Z77];IF(MONTH([Calcoli.Z93])=8                                              AND                                              ([Calcoli.Z93]-[.Q16]>1)                                      AND                                       ([Calcoli.Z93]-[.Q16]<10);[Calcoli.Z93];IF(MONTH([Calcoli.Z109])=8                                             AND                                             ([Calcoli.Z109]-[.Q16]>1)                                          AND                                             ([Calcoli.Z109]-[.Q16]<10);[Calcoli.Z109];IF(MONTH([Calcoli.Z169])=8                                             AND                                             ([Calcoli.Z169]-[.Q16]>1)                                          AND                                             ([Calcoli.Z169]-[.Q16]<10);[Calcoli.Z169];IF(MONTH([Calcoli.Z185])=8                                             AND                                             ([Calcoli.Z185]-[.Q16]>1)                                          AND                                             ([Calcoli.Z185]-[.Q16]<10);[Calcoli.Z185];\"\")))))))","v":null},{"$f":"of:=IF([.Q17]=\"\";\"\";\"alle ore \")","v":null},{"$f":"of:=IF([.Q17]=[Calcoli.W217];TIME([Calcoli.W218];[Calcoli.W219];0)+TIME(1;0;0);IF([.Q17]=[Calcoli.Z61];TIME([Calcoli.Z62];[Calcoli.Z63];0)+TIME(1;0;0);IF([.Q17]=[Calcoli.Z77];TIME([Calcoli.Z78];[Calcoli.Z79];0+TIME(1;0;0));IF([.Q17]=[Calcoli.Z93];TIME([Calcoli.Z94];[Calcoli.Z95];0)+TIME(1;0;0);IF([.Q17]=[Calcoli.Z109];TIME([Calcoli.Z110];[Calcoli.Z111];0)+TIME(1;0;0);IF([.Q17]=[Calcoli.Z169];TIME([Calcoli.Z170];[Calcoli.Z171];0)+TIME(1;0;0);IF([.Q17]=[Calcoli.Z185];TIME([Calcoli.Z186];[Calcoli.Z187];0)+TIME(1;0;0);\"\")))))))","v":null}]
[]
[]
[{"$f":"of:=\"Settembre \"&YEAR([Calcoli.AB4])","v":"Settembre 2017"},{"$nulls":4},{"$f":"of:=\"Ottobre \"&YEAR([Calcoli.AE4])","v":"Ottobre 2017"},{"$nulls":4},{"$f":"of:=\"Novembre \"&YEAR([Calcoli.AH4])","v":"Novembre 2017"},{"$nulls":4},{"$f":"of:=\"Dicembre \"&YEAR([Calcoli.AK4])","v":"Dicembre 2017"}]
[{"$f":"of:=IF([.B21]=[Calcoli.Z169];\"L.N. \";IF([.B21]=[Calcoli.Z185];\"P.Q. \";IF([.B21]=[Calcoli.Z201];\"L.P. \";IF([.B21]=[Calcoli.Z217];\"U.Q. \";IF([.B21]=[Calcoli.AC61];\"L.N. \";\"\")))))","v":"L.P. "},{"$f":"of:=IF(MONTH([Calcoli.Z169])=9;[Calcoli.Z169];IF(MONTH([Calcoli.Z185])=9;[Calcoli.Z185];IF(MONTH([Calcoli.Z201])=9;[Calcoli.Z201];IF(MONTH([Calcoli.Z217])=9;[Calcoli.Z217];IF(MONTH([Calcoli.AC61])=9;[Calcoli.AC61];\"\")))))","v":"2017-09-06"},{"$f":"of:=IF([.B21]=\"\";\"\";\"alle ore \")","v":"alle ore "},{"$f":"of:=IF([.B21]=[Calcoli.Z169];TIME([Calcoli.Z170];[Calcoli.Z171];0);IF([.B21]=[Calcoli.Z185];TIME([Calcoli.Z186];[Calcoli.Z187];0);IF([.B21]=[Calcoli.Z201];TIME([Calcoli.Z202];[Calcoli.Z203];0);IF([.B21]=[Calcoli.Z217];TIME([Calcoli.Z218];[Calcoli.Z219];0);IF([.B21]=[Calcoli.AC61];TIME([Calcoli.AC62];[Calcoli.AC63];0);\"\")))))+TIME(1;0;0)","v":"PT09H05M00S"},null,{"$f":"of:=IF([.G21]=[Calcoli.AC169];\"L.N. \";IF([.G21]=[Calcoli.AC185];\"P.Q. \";IF([.G21]=[Calcoli.AC201];\"L.P. \";IF([.G21]=[Calcoli.AC217];\"U.Q. \";IF([.G21]=[Calcoli.AF61];\"L.N. \";\"\")))))","v":"L.P. "},{"$f":"of:=IF(MONTH([Calcoli.AC169])=10;[Calcoli.AC169];IF(MONTH([Calcoli.AC185])=10;[Calcoli.AC185];IF(MONTH([Calcoli.AC201])=10;[Calcoli.AC201];IF(MONTH([Calcoli.AC217])=10;[Calcoli.AC217];IF(MONTH([Calcoli.AF61])=10;[Calcoli.AF61];\"\")))))","v":"2017-10-05"},{"$f":"of:=IF([.G21]=\"\";\"\";\"alle ore \")","v":"alle ore "},{"$f":"of:=IF([.G21]=[Calcoli.AC169];TIME([Calcoli.AC170];[Calcoli.AC171];0);IF([.G21]=[Calcoli.AC185];TIME([Calcoli.AC186];[Calcoli.AC187];0);IF([.G21]=[Calcoli.AC201];TIME([Calcoli.AC202];[Calcoli.AC203];0);IF([.G21]=[Calcoli.AC217];TIME([Calcoli.AC218];[Calcoli.AC219];0);IF([.G21]=[Calcoli.AF61];TIME([Calcoli.AF62];[Calcoli.AF63];0);\"\")))))+TIME(1;0;0)","v":"PT20H42M00S"},null,{"$f":"of:=IF([.L21]=[Calcoli.AF169];\"L.N. \";IF([.L21]=[Calcoli.AF185];\"P.Q. \";IF([.L21]=[Calcoli.AF201];\"L.P. \";IF([.L21]=[Calcoli.AF217];\"U.Q. \";IF([.L21]=[Calcoli.AI61];\"L.N. \";\"\")))))","v":"L.P. "},{"$f":"of:=IF(MONTH([Calcoli.AF169])=11;[Calcoli.AF169];IF(MONTH([Calcoli.AF185])=11;[Calcoli.AF185];IF(MONTH([Calcoli.AF201])=11;[Calcoli.AF201];IF(MONTH([Calcoli.AF217])=11;[Calcoli.AF217];IF(MONTH([Calcoli.AI61])=11;[Calcoli.AI61];\"\")))))","v":"2017-11-04"},{"$f":"of:=IF([.L21]=\"\";\"\";\"alle ore \")","v":"alle ore "},{"$f":"of:=IF([.L21]=[Calcoli.AF169];TIME([Calcoli.AF170];[Calcoli.AF171];0);IF([.L21]=[Calcoli.AF185];TIME([Calcoli.AF186];[Calcoli.AF187];0);IF([.L21]=[Calcoli.AF201];TIME([Calcoli.AF202];[Calcoli.AF203];0);IF([.L21]=[Calcoli.AF217];TIME([Calcoli.AF218];[Calcoli.AF219];0);IF([.L21]=[Calcoli.AI61];TIME([Calcoli.AI62];[Calcoli.AI63];0);\"\")))))","v":"PT06H25M00S"},null,{"$f":"of:=IF([.Q21]=[Calcoli.AI169];\"L.N. \";IF([.Q21]=[Calcoli.AI185];\"P.Q. \";IF([.Q21]=[Calcoli.AI201];\"L.P. \";IF([.Q21]=[Calcoli.AI217];\"U.Q. \";IF([.Q21]=[Calcoli.AL61];\"L.N. \";\"\")))))","v":"L.P. "},{"$f":"of:=IF(MONTH([Calcoli.AI169])=12;[Calcoli.AI169];IF(MONTH([Calcoli.AI185])=12;[Calcoli.AI185];IF(MONTH([Calcoli.AI201])=12;[Calcoli.AI201];IF(MONTH([Calcoli.AI217])=12;[Calcoli.AI217];IF(MONTH([Calcoli.AL61])=12;[Calcoli.AL61];\"\")))))","v":"2017-12-03"},{"$f":"of:=IF([.Q21]=\"\";\"\";\"alle ore \")","v":"alle ore "},{"$f":"of:=IF([.Q21]=[Calcoli.AI169];TIME([Calcoli.AI170];[Calcoli.AI171];0);IF([.Q21]=[Calcoli.AI185];TIME([Calcoli.AI186];[Calcoli.AI187];0);IF([.Q21]=[Calcoli.AI201];TIME([Calcoli.AI202];[Calcoli.AI203];0);IF([.Q21]=[Calcoli.AI217];TIME([Calcoli.AI218];[Calcoli.AI219];0);IF([.Q21]=[Calcoli.AL61];TIME([Calcoli.AL62];[Calcoli.AL63];0);\"\")))))","v":"PT16H49M00S"}]
[{"$f":"of:=IF([.B22]=\"\";\"\";IF([.A21]=\"L.N. \";\"P.Q. \";IF([.A21]=\"P.Q. \";\"L.P. \";IF([.A21]=\"L.P. \";\"U.Q. \";IF([.A21]=\"U.Q. \";\"L.N. \";\"\")))))","v":"U.Q. "},{"$f":"of:=IF(MONTH([Calcoli.Z185])=9                                     AND                                           ([Calcoli.Z185]-[.B21]>1)                                  AND                                           ([Calcoli.Z185]-[.B21]<10);[Calcoli.Z185];IF(MONTH([Calcoli.Z201])=9                                 AND                                           ([Calcoli.Z201]-[.B21]>1)                                      AND                                           ([Calcoli.Z201]-[.B21]<10);[Calcoli.Z201];IF(MONTH([Calcoli.Z217])=9                               AND                                           ([Calcoli.Z217]-[.B21]>1)                                           AND                                           ([Calcoli.Z217]-[.B21]<10);[Calcoli.Z217];IF(MONTH([Calcoli.AC61])=9                                           AND                                           ([Calcoli.AC61]-[.B21]>1)                                   AND                                    ([Calcoli.AC61]-[.B21]<10);[Calcoli.AC61];IF(MONTH([Calcoli.AC77])=9                                          AND                                          ([Calcoli.AC77]-[.B21]>1)                                       AND                                          ([Calcoli.AC77]-[.B21]<10);[Calcoli.AC77];\"\")))))","v":"2017-09-13"},{"$f":"of:=IF([.B22]=\"\";\"\";\"alle ore \")","v":"alle ore "},{"$f":"of:=IF([.B22]=[Calcoli.Z185];TIME([Calcoli.Z186];[Calcoli.Z187];0);IF([.B22]=[Calcoli.Z201];TIME([Calcoli.XZ202];[Calcoli.Z203];0);IF([.B22]=[Calcoli.Z217];TIME([Calcoli.Z218];[Calcoli.Z219];0);IF([.B22]=[Calcoli.AC61];TIME([Calcoli.AC62];[Calcoli.AC63];0);IF([.B22]=[Calcoli.AC77];TIME([Calcoli.AC78];[Calcoli.AC79];0);\"\")))))+TIME(1;0;0)","v":"PT08H27M00S"},null,{"$f":"of:=IF([.G22]=\"\";\"\";IF([.F21]=\"L.N. \";\"P.Q. \";IF([.F21]=\"P.Q. \";\"L.P. \";IF([.F21]=\"L.P. \";\"U.Q. \";IF([.F21]=\"U.Q. \";\"L.N. \";\"\")))))","v":"U.Q. "},{"$f":"of:=IF(MONTH([Calcoli.AC185])=10                                      AND                                            ([Calcoli.AC185]-[.G21]>1)                                   AND                                            ([Calcoli.AC185]-[.G21]<10);[Calcoli.AC185];IF(MONTH([Calcoli.AC201])=10                                  AND                                            ([Calcoli.AC201]-[.G21]>1)                                       AND                                            ([Calcoli.AC201]-[.G21]<10);[Calcoli.AC201];IF(MONTH([Calcoli.AC217])=10                                AND                                            ([Calcoli.AC217]-[.G21]>1)                                            AND                                            ([Calcoli.AC217]-[.G21]<10);[Calcoli.AC217];IF(MONTH([Calcoli.AF61])=10                                            AND                                            ([Calcoli.AF61]-[.G21]>1)                                    AND                                     ([Calcoli.AF61]-[.G21]<10);[Calcoli.AF61];IF(MONTH([Calcoli.AF77])=10                                           AND                                           ([Calcoli.AF77]-[.G21]>1)                                        AND                                           ([Calcoli.AF77]-[.G21]<10);[Calcoli.AF77];\"\")))))","v":"2017-10-12"},{"$f":"of:=IF([.G22]=\"\";\"\";\"alle ore \")","v":"alle ore "},{"$f":"of:=IF([.G22]=[Calcoli.AC185];TIME([Calcoli.AC186];[Calcoli.AC187];0);IF([.G22]=[Calcoli.AC201];TIME([Calcoli.AC202];[Calcoli.AC203];0);IF([.G22]=[Calcoli.AC217];TIME([Calcoli.AC218];[Calcoli.AC219];0);IF([.G22]=[Calcoli.AF61];TIME([Calcoli.AF62];[Calcoli.AF63];0);IF([.G22]=[Calcoli.AF77];TIME([Calcoli.AF78];[Calcoli.AF79];0);\"\")))))+TIME(1;0;0)","v":"PT14H28M00S"},null,{"$f":"of:=IF([.L22]=\"\";\"\";IF([.K21]=\"L.N. \";\"P.Q. \";IF([.K21]=\"P.Q. \";\"L.P. \";IF([.K21]=\"L.P. \";\"U.Q. \";IF([.K21]=\"U.Q. \";\"L.N. \";\"\")))))","v":"U.Q. "},{"$f":"of:=IF(MONTH([Calcoli.AF185])=11                                         AND                                               ([Calcoli.AF185]-[.L21]>1)                                      AND                                               ([Calcoli.AF185]-[.L21]<10);[Calcoli.AF185];IF(MONTH([Calcoli.AF201])=11                                     AND                                               ([Calcoli.AF201]-[.L21]>1)                                          AND                                               ([Calcoli.AF201]-[.L21]<10);[Calcoli.AF201];IF(MONTH([Calcoli.AF217])=11                                   AND                                               ([Calcoli.AF217]-[.L21]>1)                                               AND                                               ([Calcoli.AF217]-[.L21]<10);[Calcoli.AF217];IF(MONTH([Calcoli.AI61])=11                                               AND                                               ([Calcoli.AI61]-[.L21]>1)                                       AND                                        ([Calcoli.AI61]-[.L21]<10);[Calcoli.AI61];IF(MONTH([Calcoli.AI77])=11                                              AND                                              ([Calcoli.AI77]-[.L21]>1)                                           AND                                              ([Calcoli.AI77]-[.L21]<10);[Calcoli.AI77];\"\")))))","v":"2017-11-10"},{"$f":"of:=IF([.L22]=\"\";\"\";\"alle ore \")","v":"alle ore "},{"$f":"of:=IF([.L22]=[Calcoli.AF185];TIME([Calcoli.AF186];[Calcoli.AF187];0);IF([.L22]=[Calcoli.AF201];TIME([Calcoli.AF202];[Calcoli.AF203];0);IF([.L22]=[Calcoli.AF217];TIME([Calcoli.AF218];[Calcoli.AF219];0);IF([.L22]=[Calcoli.AI61];TIME([Calcoli.AI62];[Calcoli.AI63];0);IF([.L22]=[Calcoli.AI77];TIME([Calcoli.AI78];[Calcoli.AI79];0);\"\")))))","v":"PT21H38M00S"},null,{"$f":"of:=IF([.Q22]=\"\";\"\";IF([.P21]=\"L.N. \";\"P.Q. \";IF([.P21]=\"P.Q. \";\"L.P. \";IF([.P21]=\"L.P. \";\"U.Q. \";IF([.P21]=\"U.Q. \";\"L.N. \";\"\")))))","v":"U.Q. "},{"$f":"of:=IF(MONTH([Calcoli.AI185])=12                                          AND                                                ([Calcoli.AI185]-[.Q21]>1)                                       AND                                                ([Calcoli.AI185]-[.Q21]<10);[Calcoli.AI185];IF(MONTH([Calcoli.AI201])=12                                      AND                                                ([Calcoli.AI201]-[.Q21]>1)                                           AND                                                ([Calcoli.AI201]-[.Q21]<10);[Calcoli.AI201];IF(MONTH([Calcoli.AI217])=12                                    AND                                                ([Calcoli.AI217]-[.Q21]>1)                                                AND                                                ([Calcoli.AI217]-[.Q21]<10);[Calcoli.AI217];IF(MONTH([Calcoli.AL61])=12                                                AND                                                ([Calcoli.AL61]-[.Q21]>1)                                        AND                                         ([Calcoli.AL61]-[.Q21]<10);[Calcoli.AL61];IF(MONTH([Calcoli.AL77])=12                                               AND                                               ([Calcoli.AL77]-[.Q21]>1)                                            AND                                               ([Calcoli.AL77]-[.Q21]<10);[Calcoli.AL77];\"\")))))","v":"2017-12-10"},{"$f":"of:=IF([.Q22]=\"\";\"\";\"alle ore \")","v":"alle ore "},{"$f":"of:=IF([.Q22]=[Calcoli.AI185];TIME([Calcoli.AI186];[Calcoli.AI187];0);IF([.Q22]=[Calcoli.AI201];TIME([Calcoli.AI202];[Calcoli.AI203];0);IF([.Q22]=[Calcoli.AI217];TIME([Calcoli.AI218];[Calcoli.AI219];0);IF([.Q22]=[Calcoli.AL61];TIME([Calcoli.AL62];[Calcoli.AL63];0);IF([.Q22]=[Calcoli.AL77];TIME([Calcoli.AL78];[Calcoli.AL79];0);\"\")))))","v":"PT08H53M00S"}]
[{"$f":"of:=IF([.B23]=\"\";\"\";IF([.A22]=\"L.N. \";\"P.Q. \";IF([.A22]=\"P.Q. \";\"L.P. \";IF([.A22]=\"L.P. \";\"U.Q. \";IF([.A22]=\"U.Q. \";\"L.N. \";\"\")))))","v":"L.N. "},{"$f":"of:=IF(MONTH([Calcoli.Z201])=9                                    AND                                           ([Calcoli.Z201]-[.B22]>1)                                  AND                                           ([Calcoli.Z201]-[.B22]<10);[Calcoli.Z201];IF(MONTH([Calcoli.Z217])=9                                 AND                                           ([Calcoli.Z217]-[.B22]>1)                                      AND                                           ([Calcoli.Z217]-[.B22]<10);[Calcoli.Z217];IF(MONTH([Calcoli.AC61])=9                               AND                                           ([Calcoli.AC61]-[.B22]>1)                                           AND                                           ([Calcoli.AC61]-[.B22]<10);[Calcoli.AC61];IF(MONTH([Calcoli.AC77])=9                                           AND                                           ([Calcoli.AC77]-[.B22]>1)                                   AND                                    ([Calcoli.AC77]-[.B22]<10);[Calcoli.AC77];IF(MONTH([Calcoli.AC93])=9                                          AND                                          ([Calcoli.AC93]-[.B22]>1)                                       AND                                          ([Calcoli.AC93]-[.B22]<10);[Calcoli.AC93];IF(MONTH([Calcoli.AC109])=9                                          AND                                          ([Calcoli.AC109]-[.B22]>1)                                       AND                                          ([Calcoli.AC109]-[.B22]<10);[Calcoli.AC109];IF(MONTH([Calcoli.AC169])=9                                          AND                                          ([Calcoli.AC169]-[.B22]>1)                                       AND                                          ([Calcoli.AC169]-[.B22]<10);[Calcoli.AC169];\"\")))))))","v":"2017-09-20"},{"$f":"of:=IF([.B23]=\"\";\"\";\"alle ore \")","v":"alle ore "},{"$f":"of:=IF([.B23]=[Calcoli.Z201];TIME([Calcoli.Z202];[Calcoli.Z203];0);IF([.B23]=[Calcoli.Z217];TIME([Calcoli.Z218];[Calcoli.Z219];0);IF([.B23]=[Calcoli.AC61];TIME([Calcoli.AC62];[Calcoli.AC63];0);IF([.B23]=[Calcoli.AC77];TIME([Calcoli.AC78];[Calcoli.AC79];0);IF([.B23]=[Calcoli.AC93];TIME([Calcoli.AC94];[Calcoli.AC95];0);IF([.B23]=[Calcoli.AC109];TIME([Calcoli.AC110];[Calcoli.AC111];0);IF([.B23]=[Calcoli.AC169];TIME([Calcoli.AC170];[Calcoli.AC171];0);\"\")))))))+TIME(1;0;0)","v":"PT07H31M00S"},null,{"$f":"of:=IF([.G23]=\"\";\"\";IF([.F22]=\"L.N. \";\"P.Q. \";IF([.F22]=\"P.Q. \";\"L.P. \";IF([.F22]=\"L.P. \";\"U.Q. \";IF([.F22]=\"U.Q. \";\"L.N. \";\"\")))))","v":"L.N. "},{"$f":"of:=IF(MONTH([Calcoli.AC201])=10                                      AND                                            ([Calcoli.AC201]-[.G22]>1)                                   AND                                            ([Calcoli.AC201]-[.G22]<10);[Calcoli.AC201];IF(MONTH([Calcoli.AC217])=10                                  AND                                            ([Calcoli.AC217]-[.G22]>1)                                       AND                                            ([Calcoli.AC217]-[.G22]<10);[Calcoli.AC217];IF(MONTH([Calcoli.AF61])=10                                AND                                            ([Calcoli.AF61]-[.G22]>1)                                            AND                                            ([Calcoli.AF61]-[.G22]<10);[Calcoli.AF61];IF(MONTH([Calcoli.AF77])=10                                            AND                                            ([Calcoli.AF77]-[.G22]>1)                                    AND                                     ([Calcoli.AF77]-[.G22]<10);[Calcoli.AF77];IF(MONTH([Calcoli.AF93])=10                                           AND                                           ([Calcoli.AF93]-[.G22]>1)                                        AND                                           ([Calcoli.AF93]-[.G22]<10);[Calcoli.AF93];IF(MONTH([Calcoli.AF109])=10                                           AND                                           ([Calcoli.AF109]-[.G22]>1)                                        AND                                           ([Calcoli.AF109]-[.G22]<10);[Calcoli.AF109];IF(MONTH([Calcoli.AF169])=10                                           AND                                           ([Calcoli.AF169]-[.G22]>1)                                        AND                                           ([Calcoli.AF169]-[.G22]<10);[Calcoli.AF169];\"\")))))))","v":"2017-10-19"},{"$f":"of:=IF([.G23]=\"\";\"\";\"alle ore \")","v":"alle ore "},{"$f":"of:=IF([.G23]=[Calcoli.AC201];TIME([Calcoli.AC202];[Calcoli.AC203];0);IF([.G23]=[Calcoli.AC217];TIME([Calcoli.AC218];[Calcoli.AC219];0);IF([.G23]=[Calcoli.AF61];TIME([Calcoli.AF62];[Calcoli.AF63];0);IF([.G23]=[Calcoli.AF77];TIME([Calcoli.AF78];[Calcoli.AF79];0);IF([.G23]=[Calcoli.AF93];TIME([Calcoli.AF94];[Calcoli.AF95];0);IF([.G23]=[Calcoli.AF109];TIME([Calcoli.AF110];[Calcoli.AF111];0);IF([.G23]=[Calcoli.AF169];TIME([Calcoli.AF170];[Calcoli.AF171];0);\"\"))))+TIME(1;0;0))))","v":"PT21H13M00S"},null,{"$f":"of:=IF([.L23]=\"\";\"\";IF([.K22]=\"L.N. \";\"P.Q. \";IF([.K22]=\"P.Q. \";\"L.P. \";IF([.K22]=\"L.P. \";\"U.Q. \";IF([.K22]=\"U.Q. \";\"L.N. \";\"\")))))","v":"L.N. "},{"$f":"of:=IF(MONTH([Calcoli.AF201])=11                                      AND                                                ([Calcoli.AF201]-[.L22]>1)                                           AND                                                ([Calcoli.AF201]-[.L22]<10);[Calcoli.AF201];IF(MONTH([Calcoli.AF217])=11                                    AND                                                ([Calcoli.AF217]-[.L22]>1)                                                AND                                                ([Calcoli.AF217]-[.L22]<10);[Calcoli.AF217];IF(MONTH([Calcoli.AI61])=11                                                AND                                                ([Calcoli.AI61]-[.L22]>1)                                        AND                                         ([Calcoli.AI61]-[.L22]<10);[Calcoli.AI61];IF(MONTH([Calcoli.AI77])=11                                               AND                                               ([Calcoli.AI77]-[.L22]>1)                                            AND                                               ([Calcoli.AI77]-[.L22]<10);[Calcoli.AI77];IF(MONTH([Calcoli.AI93])=11                                          AND                                                ([Calcoli.AI93]-[.L22]>1)                                       AND                                                ([Calcoli.AI93]-[.L22]<10);[Calcoli.AI93];IF(MONTH([Calcoli.AI109])=11                                          AND                                                ([Calcoli.AI109]-[.L22]>1)                                       AND                                                ([Calcoli.AI109]-[.L22]<10);[Calcoli.AI109];IF(MONTH([Calcoli.AI169])=11                                          AND                                                ([Calcoli.AI169]-[.L22]>1)                                       AND                                                ([Calcoli.AI169]-[.L22]<10);[Calcoli.AI169];\"\")))))))","v":"2017-11-18"},{"$f":"of:=IF([.L23]=\"\";\"\";\"alle ore \")","v":"alle ore "},{"$f":"of:=IF([.L23]=[Calcoli.AF201];TIME([Calcoli.AF202];[Calcoli.AF203];0);IF([.L23]=[Calcoli.AF217];TIME([Calcoli.AF218];[Calcoli.AF219];0);IF([.L23]=[Calcoli.AI61];TIME([Calcoli.AI62];[Calcoli.AI63];0);IF([.L23]=[Calcoli.AI77];TIME([Calcoli.AI78];[Calcoli.AI79];0);IF([.L23]=[Calcoli.AI93];TIME([Calcoli.AI94];[Calcoli.AI95];0);IF([.L23]=[Calcoli.AI109];TIME([Calcoli.AI110];[Calcoli.AI111];0);IF([.L23]=[Calcoli.AI169];TIME([Calcoli.AI170];[Calcoli.AI171];0);\"\")))))))","v":"PT12H43M00S"},null,{"$f":"of:=IF([.Q23]=\"\";\"\";IF([.P22]=\"L.N. \";\"P.Q. \";IF([.P22]=\"P.Q. \";\"L.P. \";IF([.P22]=\"L.P. \";\"U.Q. \";IF([.P22]=\"U.Q. \";\"L.N. \";\"\")))))","v":"L.N. "},{"$f":"of:=IF(MONTH([Calcoli.AI201])=12                                     AND                                               ([Calcoli.AI201]-[.Q22]>1)                                          AND                                               ([Calcoli.AI201]-[.Q22]<10);[Calcoli.AI201];IF(MONTH([Calcoli.AI217])=12                                   AND                                               ([Calcoli.AI217]-[.Q22]>1)                                               AND                                               ([Calcoli.AI217]-[.Q22]<10);[Calcoli.AI217];IF(MONTH([Calcoli.AL61])=12                                               AND                                               ([Calcoli.AL61]-[.Q22]>1)                                       AND                                        ([Calcoli.AL61]-[.Q22]<10);[Calcoli.AL61];IF(MONTH([Calcoli.AL77])=12                                              AND                                              ([Calcoli.AL77]-[.Q22]>1)                                           AND                                              ([Calcoli.AL77]-[.Q22]<10);[Calcoli.AL77];IF(MONTH([Calcoli.AL93])=12                                         AND                                               ([Calcoli.AL93]-[.Q22]>1)                                      AND                                               ([Calcoli.AL93]-[.Q22]<10);[Calcoli.AL93];IF(MONTH([Calcoli.AL109])=12                                         AND                                               ([Calcoli.AL109]-[.Q22]>1)                                      AND                                               ([Calcoli.AL109]-[.Q22]<10);[Calcoli.AL109];IF(MONTH([Calcoli.AL169])=12                                         AND                                               ([Calcoli.AL169]-[.Q22]>1)                                      AND                                               ([Calcoli.AL169]-[.Q22]<10);[Calcoli.AL169];\"\")))))))","v":"2017-12-18"},{"$f":"of:=IF([.Q23]=\"\";\"\";\"alle ore \")","v":"alle ore "},{"$f":"of:=IF([.Q23]=[Calcoli.AI201];TIME([Calcoli.AI202];[Calcoli.AI203];0);IF([.Q23]=[Calcoli.AI217];TIME([Calcoli.AI218];[Calcoli.AI219];0);IF([.Q23]=[Calcoli.AL61];TIME([Calcoli.AL62];[Calcoli.AL63];0);IF([.Q23]=[Calcoli.AL77];TIME([Calcoli.AL78];[Calcoli.AL79];0);IF([.Q23]=[Calcoli.AL93];TIME([Calcoli.AL94];[Calcoli.AL95];0);IF([.Q23]=[Calcoli.AL109];TIME([Calcoli.AL110];[Calcoli.AL111];0);IF([.Q23]=[Calcoli.AL169];TIME([Calcoli.AL170];[Calcoli.AL171];0);\"\")))))))","v":"PT07H32M00S"}]
[{"$f":"of:=IF([.B24]=\"\";\"\";IF([.A23]=\"L.N. \";\"P.Q. \";IF([.A23]=\"P.Q. \";\"L.P. \";IF([.A23]=\"L.P. \";\"U.Q. \";IF([.A23]=\"U.Q. \";\"L.N. \";\"\")))))","v":"P.Q. "},{"$f":"of:=IF(MONTH([Calcoli.Z217])=9                                      AND                                            ([Calcoli.Z217]-[.B23]>1)                                   AND                                            ([Calcoli.Z217]-[.B23]<10);[Calcoli.Z217];IF(MONTH([Calcoli.AC61])=9                                  AND                                            ([Calcoli.AC61]-[.B23]>1)                                       AND                                            ([Calcoli.AC61]-[.B23]<10);[Calcoli.AC61];IF(MONTH([Calcoli.AC77])=9                                AND                                            ([Calcoli.AC77]-[.B23]>1)                                            AND                                            ([Calcoli.AC77]-[.B23]<10);[Calcoli.AC77];IF(MONTH([Calcoli.AC93])=9                                            AND                                            ([Calcoli.AC93]-[.B23]>1)                                    AND                                     ([Calcoli.AC93]-[.B23]<10);[Calcoli.AC93];IF(MONTH([Calcoli.AC109])=9                                           AND                                           ([Calcoli.AC109]-[.B23]>1)                                        AND                                           ([Calcoli.AC109]-[.B23]<10);[Calcoli.AC109];IF(MONTH([Calcoli.AC169])=9                                           AND                                           ([Calcoli.AC169]-[.B23]>1)                                        AND                                           ([Calcoli.AC169]-[.B23]<10);[Calcoli.AC169];IF(MONTH([Calcoli.AC185])=9                                           AND                                           ([Calcoli.AC185]-[.B23]>1)                                        AND                                           ([Calcoli.AC185]-[.B23]<10);[Calcoli.AC185];\"\")))))))","v":"2017-09-28"},{"$f":"of:=IF([.B24]=\"\";\"\";\"alle ore \")","v":"alle ore "},{"$f":"of:=IF([.B24]=[Calcoli.Z217];TIME([Calcoli.Z218];[Calcoli.Z219];0);IF([.B24]=[Calcoli.AC61];TIME([Calcoli.AC62];[Calcoli.AC63];0);IF([.B24]=[Calcoli.AC77];TIME([Calcoli.AC78];[Calcoli.AC79];0);IF([.B24]=[Calcoli.AC93];TIME([Calcoli.AC94];[Calcoli.AC95];0);IF([.B24]=[Calcoli.AC109];TIME([Calcoli.AC110];[Calcoli.AC111];0);IF([.B24]=[Calcoli.AC169];TIME([Calcoli.AC170];[Calcoli.AC171];0);IF([.B24]=[Calcoli.AC185];TIME([Calcoli.AC186];[Calcoli.AC187];0);\"\")))))))+TIME(1;0;0)","v":"PT04H51M00S"},null,{"$f":"of:=IF([.G24]=\"\";\"\";IF([.F23]=\"L.N. \";\"P.Q. \";IF([.F23]=\"P.Q. \";\"L.P. \";IF([.F23]=\"L.P. \";\"U.Q. \";IF([.F23]=\"U.Q. \";\"L.N. \";\"\")))))","v":"P.Q. "},{"$f":"of:=IF(MONTH([Calcoli.AC217])=10                                     AND                                            ([Calcoli.AC217]-[.G23]>1)                                   AND                                            ([Calcoli.AC217]-[.G23]<10);[Calcoli.AC217];IF(MONTH([Calcoli.AF61])=10                                  AND                                            ([Calcoli.AF61]-[.G23]>1)                                       AND                                            ([Calcoli.AF61]-[.G23]<10);[Calcoli.AF61];IF(MONTH([Calcoli.AF77])=10                                AND                                            ([Calcoli.AF77]-[.G23]>1)                                            AND                                            ([Calcoli.AF77]-[.G23]<10);[Calcoli.AF77];IF(MONTH([Calcoli.AF93])=10                                            AND                                            ([Calcoli.AF93]-[.G23]>1)                                    AND                                     ([Calcoli.AF93]-[.G23]<10);[Calcoli.AF93];IF(MONTH([Calcoli.AF109])=10                                           AND                                           ([Calcoli.AF109]-[.G23]>1)                                        AND                                           ([Calcoli.AF109]-[.G23]<10);[Calcoli.AF109];IF(MONTH([Calcoli.AF169])=10                                           AND                                           ([Calcoli.AF169]-[.G23]>1)                                        AND                                           ([Calcoli.AF169]-[.G23]<10);[Calcoli.AF169];IF(MONTH([Calcoli.AF185])=10                                           AND                                           ([Calcoli.AF185]-[.G23]>1)                                        AND                                           ([Calcoli.AF185]-[.G23]<10);[Calcoli.AF185];\"\")))))))","v":"2017-10-27"},{"$f":"of:=IF([.G24]=\"\";\"\";\"alle ore \")","v":"alle ore "},{"$f":"of:=IF([.G24]=[Calcoli.AC217];TIME([Calcoli.AC218];[Calcoli.AC219];0);IF([.G24]=[Calcoli.AF61];TIME([Calcoli.AF62];[Calcoli.AF63];0);IF([.G24]=[Calcoli.AF77];TIME([Calcoli.AF78];[Calcoli.AF79];0);IF([.G24]=[Calcoli.AF93];TIME([Calcoli.AF94];[Calcoli.AF95];0);IF([.G24]=[Calcoli.AF109];TIME([Calcoli.AF110];[Calcoli.AF111];0);IF([.G24]=[Calcoli.AF169];TIME([Calcoli.AF170];[Calcoli.AF171];0);IF([.G24]>=[Calcoli.AF185];TIME([Calcoli.AF186];[Calcoli.AF187];0);\"\")))))))+IF([.G24]>=[Calcoli.B241];+TIME(0;0;0);+TIME(1;0;0))","v":"PT24H20M00S"},null,{"$f":"of:=IF([.L24]=\"\";\"\";IF([.K23]=\"L.N. \";\"P.Q. \";IF([.K23]=\"P.Q. \";\"L.P. \";IF([.K23]=\"L.P. \";\"U.Q. \";IF([.K23]=\"U.Q. \";\"L.N. \";\"\")))))","v":"P.Q. "},{"$f":"of:=IF(MONTH([Calcoli.AF217])=11                                          AND                                                ([Calcoli.AF217]-[.L23]>1)                                       AND                                                ([Calcoli.AF217]-[.L23]<10);[Calcoli.AF217];IF(MONTH([Calcoli.AI61])=11                                      AND                                                ([Calcoli.AI61]-[.L23]>1)                                           AND                                                ([Calcoli.AI61]-[.L23]<10);[Calcoli.AI61];IF(MONTH([Calcoli.AI77])=11                                    AND                                                ([Calcoli.AI77]-[.L23]>1)                                                AND                                                ([Calcoli.AI77]-[.L23]<10);[Calcoli.AI77];IF(MONTH([Calcoli.AI93])=11                                                AND                                                ([Calcoli.AI93]-[.L23]>1)                                        AND                                         ([Calcoli.AI93]-[.L23]<10);[Calcoli.AI93];IF(MONTH([Calcoli.AI109])=11                                               AND                                               ([Calcoli.AI109]-[.L23]>1)                                            AND                                               ([Calcoli.AI109]-[.L23]<10);[Calcoli.AI109];IF(MONTH([Calcoli.AI169])=11                                               AND                                               ([Calcoli.AI169]-[.L23]>1)                                            AND                                               ([Calcoli.AI169]-[.L23]<10);[Calcoli.AI169];IF(MONTH([Calcoli.AI185])=11                                               AND                                               ([Calcoli.AI185]-[.L23]>1)                                            AND                                               ([Calcoli.AI185]-[.L23]<10);[Calcoli.AI185];\"\")))))))","v":"2017-11-26"},{"$f":"of:=IF([.L24]=\"\";\"\";\"alle ore \")","v":"alle ore "},{"$f":"of:=IF([.L24]=[Calcoli.AF217];TIME([Calcoli.AF218];[Calcoli.AF219];0);IF([.L24]=[Calcoli.AI61];TIME([Calcoli.AI62];[Calcoli.AI63];0);IF([.L24]=[Calcoli.AI77];TIME([Calcoli.AI78];[Calcoli.AI79];0);IF([.L24]=[Calcoli.AI93];TIME([Calcoli.AI94];[Calcoli.AI95];0);IF([.L24]=[Calcoli.AI109];TIME([Calcoli.AI110];[Calcoli.AI111];0);IF([.L24]=[Calcoli.AI169];TIME([Calcoli.AI170];[Calcoli.AI171];0);IF([.L24]=[Calcoli.AI185];TIME([Calcoli.AI186];[Calcoli.AI187];0);\"\")))))))","v":"PT18H00M00S"},null,{"$f":"of:=IF([.Q24]=\"\";\"\";IF([.P23]=\"L.N. \";\"P.Q. \";IF([.P23]=\"P.Q. \";\"L.P. \";IF([.P23]=\"L.P. \";\"U.Q. \";IF([.P23]=\"U.Q. \";\"L.N. \";\"\")))))","v":"P.Q. "},{"$f":"of:=IF(MONTH([Calcoli.AI217])=12                                           AND                                                 ([Calcoli.AI217]-[.Q23]>1)                                        AND                                                 ([Calcoli.AI217]-[.Q23]<10);[Calcoli.AI217];IF(MONTH([Calcoli.AL61])=11                                       AND                                                 ([Calcoli.AL61]-[.Q23]>1)                                            AND                                                 ([Calcoli.AL61]-[.Q23]<10);[Calcoli.AL61];IF(MONTH([Calcoli.AL77])=12                                     AND                                                 ([Calcoli.AL77]-[.Q23]>1)                                                 AND                                                 ([Calcoli.AL77]-[.Q23]<10);[Calcoli.AL77];IF(MONTH([Calcoli.AL93])=12                                                 AND                                                 ([Calcoli.AL93]-[.Q23]>1)                                         AND                                          ([Calcoli.AL93]-[.Q23]<10);[Calcoli.AL93];IF(MONTH([Calcoli.AL109])=12                                                AND                                                ([Calcoli.AL109]-[.Q23]>1)                                             AND                                                ([Calcoli.AL109]-[.Q23]<10);[Calcoli.AL109];IF(MONTH([Calcoli.AL169])=12                                                AND                                                ([Calcoli.AL169]-[.Q23]>1)                                             AND                                                ([Calcoli.AL169]-[.Q23]<10);[Calcoli.AL169];IF(MONTH([Calcoli.AL185])=12                                                AND                                                ([Calcoli.AL185]-[.Q23]>1)                                             AND                                                ([Calcoli.AL185]-[.Q23]<10);[Calcoli.AL185];\"\")))))))","v":"2017-12-26"},{"$f":"of:=IF([.Q24]=\"\";\"\";\"alle ore \")","v":"alle ore "},{"$f":"of:=IF([.Q24]=[Calcoli.AI217];TIME([Calcoli.AI218];[Calcoli.AI219];0);IF([.Q24]=[Calcoli.AL61];TIME([Calcoli.AL62];[Calcoli.AL63];0);IF([.Q24]=[Calcoli.AL77];TIME([Calcoli.AL78];[Calcoli.AL79];0);IF([.Q24]=[Calcoli.AL93];TIME([Calcoli.AL94];[Calcoli.AL95];0);IF([.Q24]=[Calcoli.AL109];TIME([Calcoli.AL110];[Calcoli.AL111];0);IF([.Q24]=[Calcoli.AL169];TIME([Calcoli.AL170];[Calcoli.AL171];0);IF([.Q24]=[Calcoli.AL185];TIME([Calcoli.AL186];[Calcoli.AL187];0);\"\")))))))","v":"PT10H17M00S"}]
[{"$f":"of:=IF([.B25]=\"\";\"\";IF([.A24]=\"L.N. \";\"P.Q. \";IF([.A24]=\"P.Q. \";\"L.P. \";IF([.A24]=\"L.P. \";\"U.Q. \";IF([.A24]=\"U.Q. \";\"L.N. \";\"\")))))","v":null},{"$f":"of:=IF(MONTH([Calcoli.Z217])=9                                      AND                                            ([Calcoli.Z217]-[.B24]>1)                                   AND                                            ([Calcoli.Z217]-[.B24]<10);[Calcoli.Z217];IF(MONTH([Calcoli.AC61])=9                                  AND                                            ([Calcoli.AC61]-[.B24]>1)                                       AND                                            ([Calcoli.AC61]-[.B24]<10);[Calcoli.AC61];IF(MONTH([Calcoli.AC77])=9                                AND                                            ([Calcoli.AC77]-[.B24]>1)                                            AND                                            ([Calcoli.AC77]-[.B24]<10);[Calcoli.AC77];IF(MONTH([Calcoli.AC93])=9                                            AND                                            ([Calcoli.AC93]-[.B24]>1)                                    AND                                     ([Calcoli.AC93]-[.B24]<10);[Calcoli.AC93];IF(MONTH([Calcoli.AC109])=9                                           AND                                           ([Calcoli.AC109]-[.B24]>1)                                        AND                                           ([Calcoli.AC109]-[.B24]<10);[Calcoli.AC109];IF(MONTH([Calcoli.AC169])=9                                           AND                                           ([Calcoli.AC169]-[.B24]>1)                                        AND                                           ([Calcoli.AC169]-[.B24]<10);[Calcoli.AC169];IF(MONTH([Calcoli.AC185])=9                                           AND                                           ([Calcoli.AC185]-[.B24]>1)                                        AND                                           ([Calcoli.AC185]-[.B24]<10);[Calcoli.AC185];\"\")))))))","v":null},{"$f":"of:=IF([CALENDARY_MoonPhaase.B25]=\"\";\"\";\"alle ore \")","v":null},{"$f":"of:=IF([.B25]=[Calcoli.Z217];TIME([Calcoli.Z218];[Calcoli.Z219];0)+TIME(1;0;0);IF([.B25]=[Calcoli.AC61];TIME([Calcoli.AC62];[Calcoli.AC63];0)+TIME(1;0;0);IF([.B25]=[Calcoli.AC77];TIME([Calcoli.AC78];[Calcoli.AC79];0)+TIME(1;0;0);IF([.B25]=[Calcoli.AC93];TIME([Calcoli.AC94];[Calcoli.AC95];0)+TIME(1;0;0);IF([.B25]=[Calcoli.AC109];TIME([Calcoli.AC110];[Calcoli.AC111];0)+TIME(1;0;0);IF([.B25]=[Calcoli.AC169];TIME([Calcoli.AC170];[Calcoli.AC171];0)+TIME(1;0;0);IF([.B25]=[Calcoli.AC185];TIME([Calcoli.AC186];[Calcoli.AC187];0)+TIME(1;0;0);\"\")))))))","v":null},null,{"$f":"of:=IF([.G25]=\"\";\"\";IF([.F24]=\"L.N. \";\"P.Q. \";IF([.F24]=\"P.Q. \";\"L.P. \";IF([.F24]=\"L.P. \";\"U.Q. \";IF([.F24]=\"U.Q. \";\"L.N. \";\"\")))))","v":null},{"$f":"of:=IF(MONTH([Calcoli.AC217])=10                                      AND                                             ([Calcoli.AC217]-[.G24]>1)                                    AND                                             ([Calcoli.AC217]-[.G24]<10);[Calcoli.AC217];IF(MONTH([Calcoli.AF61])=10                                   AND                                             ([Calcoli.AF61]-[.G24]>1)                                        AND                                             ([Calcoli.AF61]-[.G24]<10);[Calcoli.AF61];IF(MONTH([Calcoli.AF77])=10                                 AND                                             ([Calcoli.AF77]-[.G24]>1)                                             AND                                             ([Calcoli.AF77]-[.G24]<10);[Calcoli.AF77];IF(MONTH([Calcoli.AF93])=10                                             AND                                             ([Calcoli.AF93]-[.G24]>1)                                     AND                                      ([Calcoli.AF93]-[.G24]<10);[Calcoli.AF93];IF(MONTH([Calcoli.AF109])=10                                            AND                                            ([Calcoli.AF109]-[.G24]>1)                                         AND                                            ([Calcoli.AF109]-[.G24]<10);[Calcoli.AF109];IF(MONTH([Calcoli.AF169])=10                                            AND                                            ([Calcoli.AF169]-[.G24]>1)                                         AND                                            ([Calcoli.AF169]-[.G24]<10);[Calcoli.AF169];IF(MONTH([Calcoli.AF185])=10                                            AND                                            ([Calcoli.AF185]-[.G24]>1)                                         AND                                            ([Calcoli.AF185]-[.G24]<10);[Calcoli.AF185];\"\")))))))","v":null},{"$f":"of:=IF([.G25]=\"\";\"\";\"alle ore \")","v":null},{"$f":"of:=IF([.G25]=[Calcoli.AC217];TIME([Calcoli.AC218];[Calcoli.AC219];0);IF([.G25]=[Calcoli.AF61];TIME([Calcoli.AF62];[Calcoli.AF63];0);IF([.G25]=[Calcoli.AF77];TIME([Calcoli.AF78];[Calcoli.AF79];0);IF([.G25]=[Calcoli.AF93];TIME([Calcoli.AF94];[Calcoli.AF95];0);IF([.G25]=[Calcoli.AF109];TIME([Calcoli.AF110];[Calcoli.AF111];0);IF([.G25]=[Calcoli.AF169];TIME([Calcoli.AF170];[Calcoli.AF171];0);IF([.G25]=[Calcoli.AF185];TIME([Calcoli.AF186];[Calcoli.AF187];0);\"\")))))))","v":null},null,{"$f":"of:=IF([.L25]=\"\";\"\";IF([.K24]=\"L.N. \";\"P.Q. \";IF([.K24]=\"P.Q. \";\"L.P. \";IF([.K24]=\"L.P. \";\"U.Q. \";IF([.K24]=\"U.Q. \";\"L.N. \";\"\")))))","v":null},{"$f":"of:=IF(MONTH([Calcoli.AF217])=11                                           AND                                                 ([Calcoli.AF217]-[.L24]>1)                                        AND                                                 ([Calcoli.AF217]-[.L24]<10);[Calcoli.AF217];IF(MONTH([Calcoli.AI61])=11                                       AND                                                 ([Calcoli.AI61]-[.L24]>1)                                            AND                                                 ([Calcoli.AI61]-[.L24]<10);[Calcoli.AI61];IF(MONTH([Calcoli.AI77])=11                                     AND                                                 ([Calcoli.AI77]-[.L24]>1)                                                 AND                                                 ([Calcoli.AI77]-[.L24]<10);[Calcoli.AI77];IF(MONTH([Calcoli.AI93])=11                                                 AND                                                 ([Calcoli.AI93]-[.L24]>1)                                         AND                                          ([Calcoli.AI93]-[.L24]<10);[Calcoli.AI93];IF(MONTH([Calcoli.AI109])=11                                                AND                                                ([Calcoli.AI109]-[.L24]>1)                                             AND                                                ([Calcoli.AI109]-[.L24]<10);[Calcoli.AI109];IF(MONTH([Calcoli.AI169])=11                                                AND                                                ([Calcoli.AI169]-[.L24]>1)                                             AND                                                ([Calcoli.AI169]-[.L24]<10);[Calcoli.AI169];IF(MONTH([Calcoli.AI185])=11                                                AND                                                ([Calcoli.AI185]-[.L24]>1)                                             AND                                                ([Calcoli.AI185]-[.L24]<10);[Calcoli.AI185];\"\")))))))","v":null},{"$f":"of:=IF([.L25]=\"\";\"\";\"alle ore \")","v":null},{"$f":"of:=IF([.L25]=[Calcoli.AF217];TIME([Calcoli.AF218];[Calcoli.AF219];0);IF([.L25]=[Calcoli.AI61];TIME([Calcoli.AI62];[Calcoli.AI63];0);IF([.L25]=[Calcoli.AI77];TIME([Calcoli.AI78];[Calcoli.AI79];0);IF([.L25]=[Calcoli.AI93];TIME([Calcoli.AI94];[Calcoli.AI95];0);IF([.L25]=[Calcoli.AI109];TIME([Calcoli.AI110];[Calcoli.AI111];0);IF([.L25]=[Calcoli.AI169];TIME([Calcoli.AI170];[Calcoli.AI171];0);IF([.L25]=[Calcoli.AI185];TIME([Calcoli.AI186];[Calcoli.AI187];0);\"\")))))))","v":null},null,{"$f":"of:=IF([.Q25]=\"\";\"\";IF([.P24]=\"L.N. \";\"P.Q. \";IF([.P24]=\"P.Q. \";\"L.P. \";IF([.P24]=\"L.P. \";\"U.Q. \";IF([.P24]=\"U.Q. \";\"L.N. \";\"\")))))","v":null},{"$f":"of:=IF(MONTH([Calcoli.AI217])=12                                            AND                                                  ([Calcoli.AI217]-[.Q24]>1)                                         AND                                                  ([Calcoli.AI217]-[.Q24]<10);[Calcoli.AI217];IF(MONTH([Calcoli.AL61])=11                                        AND                                                  ([Calcoli.AL61]-[.Q24]>1)                                             AND                                                  ([Calcoli.AL61]-[.Q24]<10);[Calcoli.AL61];IF(MONTH([Calcoli.AL77])=12                                      AND                                                  ([Calcoli.AL77]-[.Q24]>1)                                                  AND                                                  ([Calcoli.AL77]-[.Q24]<10);[Calcoli.AL77];IF(MONTH([Calcoli.AL93])=12                                                  AND                                                  ([Calcoli.AL93]-[.Q24]>1)                                          AND                                           ([Calcoli.AL93]-[.Q24]<10);[Calcoli.AL93];IF(MONTH([Calcoli.AL109])=12                                                 AND                                                 ([Calcoli.AL109]-[.Q24]>1)                                              AND                                                 ([Calcoli.AL109]-[.Q24]<10);[Calcoli.AL109];IF(MONTH([Calcoli.AL169])=12                                                 AND                                                 ([Calcoli.AL169]-[.Q24]>1)                                              AND                                                 ([Calcoli.AL169]-[.Q24]<10);[Calcoli.AL169];IF(MONTH([Calcoli.AL185])=12                                                 AND                                                 ([Calcoli.AL185]-[.Q24]>1)                                              AND                                                 ([Calcoli.AL185]-[.Q24]<10);[Calcoli.AL185];\"\")))))))","v":null},{"$f":"of:=IF([.Q25]=\"\";\"\";\"alle ore \")","v":null},{"$f":"of:=IF([.Q25]=[Calcoli.AI217];TIME([Calcoli.AI218];[Calcoli.AI219];0);IF([.Q25]=[Calcoli.AL61];TIME([Calcoli.AL62];[Calcoli.AL63];0);IF([.Q25]=[Calcoli.AL77];TIME([Calcoli.AL78];[Calcoli.AL79];0);IF([.Q25]=[Calcoli.AL93];TIME([Calcoli.AL94];[Calcoli.AL95];0);IF([.Q25]=[Calcoli.AL109];TIME([Calcoli.AL110];[Calcoli.AL111];0);IF([.Q25]=[Calcoli.AL169];TIME([Calcoli.AL170];[Calcoli.AL171];0);IF([.Q25]=[Calcoli.AL185];TIME([Calcoli.AL186];[Calcoli.AL187];0);\"\")))))))","v":null},null,{"$f":"of:=IF([.A24]=\"L.N. \"                             AND                             ([.B25]>\"\");\"P.Q. \";IF([.A24]=\"P.Q. \"                            AND                            ([.B25]>\"\");\"L.P. \";IF([.A24]=\"L.P. \"                            AND                            ([.B25]>\"\");\"U.Q. \";IF([.A24]=\"U.Q. \"                            AND                            ([.B25]>\"\");\"L.N. \";\"\"))))","v":null}]
[]
[{"$nulls":7},{"$f":"of:=IF([CALENDARY_MoonPhaase.G27]=\"\";\"\";\"alle ore \")","v":null},{"$nulls":4},{"$f":"of:=IF([CALENDARY_MoonPhaase.L27]=\"\";\"\";\"alle ore \")","v":null},null,null,{"$f":"of:=IF([CALENDARY_MoonPhaase.Q27]=\"\";\"\";\"L.P. \")","v":null},{"$f":"of:=IF(MONTH([Calcoli.AO93])=12;[Calcoli.AO93];\"\")","v":null},{"$f":"of:=IF([CALENDARY_MoonPhaase.Q27]=\"\";\"\";\"alle ore \")","v":null}]
[]
[null," Annotazioni: ",null,"L.N. = Luna nuova – P.Q. = Primo quarto, etc… –  N.B. - L'entrata in vigore dell'ora legale è già calcolata in automatico"]
["L'ora legale inizia alle ore 02:00 del:",{"$nulls":3},{"$f":"of:=[Calcoli.$B$240]","v":"2017-03-26"},null,"Equinozio di Primavera il:",null,null,{"$f":"of:=[Calcoli.B235]","v":"2017-03-20"},null,"alle ore: ",{"$f":"of:=TIME([Calcoli.B236];[Calcoli.B237];0)","v":"PT11H26M00S"},"Solstizio d'Estate il: ",null,null,{"$f":"of:=[Calcoli.E235]","v":"2017-06-21"},"alle ore: ",{"$f":"of:=TIME([Calcoli.E236]+1;[Calcoli.E237];0)","v":"PT06H19M00S"}]
["L'ora legale termina alle ore 03:00 del:",{"$nulls":3},{"$f":"of:=[Calcoli.$B$241]","v":"2017-10-29"},null,"Equinozio d'Autunno il:",null,null,{"$f":"of:=[Calcoli.H235]","v":"2017-09-22"},null,"alle ore: ",{"$f":"of:=TIME([Calcoli.H236]+1;[Calcoli.H237];0)","v":"PT22H05M00S"},"Solstizio d'Inverno il: ",null,null,{"$f":"of:=[Calcoli.K235]","v":"2017-12-21"},"alle ore: ",{"$f":"of:=TIME([Calcoli.K236];[Calcoli.K237];0)","v":"PT17H32M00S"}]

{"sheet":"Calcoli","index":2,"n_rows":241,"n_cols":43,"rows_kept":241,"merged":[[1,6,1,7],[1,14,1,17],[1,18,1,19],[3,0,3,1],[3,3,3,4],[3,6,3,7],[3,9,3,10],[3,12,3,13],[3,15,3,16],[3,18,3,19],[3,21,3,22],[3,24,3,25],[3,27,3,28],[3,30,3,31],[3,33,3,34],[3,36,3,37],[3,39,3,40]]}
[]
[{"$nulls":6},{"$f":"of:=[CALENDARY_MoonPhaase.V2]","v":2017},{"$nulls":7},"MoonPhase  ®",{"$nulls":3},"   by “ab Solutions”    "]
[]
[{"$f":"of:=DATE([Calcoli.$G$2]-1;12;1)","v":"2016-12-01"},null,null,{"$f":"of:=DATE([Calcoli.$G$2];1;1)","v":"2017-01-01"},null,null,{"$f":"of:=DATE([Calcoli.$G$2];2;1)","v":"2017-02-01"},null,null,{"$f":"of:=DATE([Calcoli.$G$2];3;1)","v":"2017-03-01"},null,null,{"$f":"of:=DATE([Calcoli.$G$2];4;1)","v":"2017-04-01"},null,null,{"$f":"of:=DATE([Calcoli.$G$2];5;1)","v":"2017-05-01"},null,null,{"$f":"of:=DATE([Calcoli.$G$2];6;1)","v":"2017-06-01"},null,null,{"$f":"of:=DATE([Calcoli.$G$2];7;1)","v":"2017-07-01"},null,null,{"$f":"of:=DATE([Calcoli.$G$2];8;1)","v":"2017-08-01"},null,null,{"$f":"of:=DATE([Calcoli.$G$2];9;1)","v":"2017-09-01"},null,null,{"$f":"of:=DATE([Calcoli.$G$2];10;1)","v":"2017-10-01"},null,null,{"$f":"of:=DATE([Calcoli.$G$2];11;1)","v":"2017-11-01"},null,null,{"$f":"of:=DATE([Calcoli.$G$2];12;1)","v":"2017-12-01"},null,null,{"$f":"of:=DATE([Calcoli.$G$2]+1;1;1)","v":"2018-01-01"}]
[]
["_DATA",{"$f":"of:=YEAR([Calcoli.A4])+ROUND(DAYS([Calcoli.A4];DATE(YEAR([Calcoli.A4]);1;1)-1)/365;4)","v":2016.9205},null,"_DATA",{"$f":"of:=YEAR([Calcoli.D4])+ROUND(DAYS([Calcoli.D4];DATE(YEAR([Calcoli.D4]);1;1)-1)/365;4)","v":2017.0027},null,"_DATA",{"$f":"of:=YEAR([Calcoli.G4])+ROUND(DAYS([Calcoli.G4];DATE(YEAR([Calcoli.G4]);1;1)-1)/365;4)","v":2017.0877},null,"_DATA",{"$f":"of:=YEAR([Calcoli.J4])+ROUND(DAYS([Calcoli.J4];DATE(YEAR([Calcoli.J4]);1;1)-1)/365;4)","v":2017.1644},null,"_DATA",{"$f":"of:=YEAR([Calcoli.M4])+ROUND(DAYS([Calcoli.M4];DATE(YEAR([Calcoli.M4]);1;1)-1)/365;4)","v":2017.2493},null,"_DATA",{"$f":"of:=YEAR([Calcoli.P4])+ROUND(DAYS([Calcoli.P4];DATE(YEAR([Calcoli.P4]);1;1)-1)/365;4)","v":2017.3315},null,"_DATA",{"$f":"of:=YEAR([Calcoli.S4])+ROUND(DAYS([Calcoli.S4];DATE(YEAR([Calcoli.S4]);1;1)-1)/365;4)","v":2017.4164},null,"_DATA",{"$f":"of:=YEAR([Calcoli.V4])+ROUND(DAYS([Calcoli.V4];DATE(YEAR([Calcoli.V4]);1;1)-1)/365;4)","v":2017.4986},null,"_DATA",{"$f":"of:=YEAR([Calcoli.Y4])+ROUND(DAYS([Calcoli.Y4];DATE(YEAR([Calcoli.Y4]);1;1)-1)/365;4)","v":2017.5836},null,"_DATA",{"$f":"of:=YEAR([Calcoli.AB4])+ROUND(DAYS([Calcoli.AB4];DATE(YEAR([Calcoli.AB4]);1;1)-1)/365;4)","v":2017.6685},null,"_DATA",{"$f":"of:=YEAR([Calcoli.AE4])+ROUND(DAYS([Calcoli.AE4];DATE(YEAR([Calcoli.AE4]);1;1)-1)/365;4)","v":2017.7507},null,"_DATA",{"$f":"of:=YEAR([Calcoli.AH4])+ROUND(DAYS([Calcoli.AH4];DATE(YEAR([Calcoli.AH4]);1;1)-1)/365;4)","v":2017.8356},null,"_DATA",{"$f":"of:=YEAR([Calcoli.AK4])+ROUND(DAYS([Calcoli.AK4];DATE(YEAR([Calcoli.AK4]);1;1)-1)/365;4)","v":2017.9178},null,"_DATA",{"$f":"of:=YEAR([Calcoli.AN4])+ROUND(DAYS([Calcoli.AN4];DATE(YEAR([Calcoli.AN4]);1;1)-1)/365;4)","v":2018.0027}]
["K_LN",{"$f":"of:=ROUND((N([Calcoli.B6])-1900)*12.3685;0)","v":1446},null,"K_LN",{"$f":"of:=ROUND((N([Calcoli.E6])-1900)*12.3685;0)","v":1447},null,"K_LN",{"$f":"of:=ROUND((N([Calcoli.H6])-1900)*12.3685;0)","v":1448},null,"K_LN",{"$f":"of:=ROUND((N([Calcoli.K6])-1900)*12.3685;0)","v":1449},null,"K_LN",{"$f":"of:=ROUND((N([Calcoli.N6])-1900)*12.3685;0)","v":1450},null,"K_LN",{"$f":"of:=ROUND((N([Calcoli.Q6])-1900)*12.3685;0)","v":1451},null,"K_LN",{"$f":"of:=ROUND((N([Calcoli.T6])-1900)*12.3685;0)","v":1452},null,"K_LN",{"$f":"of:=ROUND((N([Calcoli.W6])-1900)*12.3685;0)","v":1453},null,"K_LN",{"$f":"of:=ROUND((N([Calcoli.Z6])-1900)*12.3685;0)","v":1454},null,"K_LN",{"$f":"of:=ROUND((N([Calcoli.AC6])-1900)*12.3685;0)","v":1455},null,"K_LN",{"$f":"of:=ROUND((N([Calcoli.AF6])-1900)*12.3685;0)","v":1456},null,"K_LN",{"$f":"of:=ROUND((N([Calcoli.AI6])-1900)*12.3685;0)","v":1457},null,"K_LN",{"$f":"of:=ROUND((N([Calcoli.AL6])-1900)*12.3685;0)","v":1458},null,"K_LN",{"$f":"of:=ROUND((N([Calcoli.AO6])-1900)*12.3685;0)","v":1460}]
["K_PQ",{"$f":"of:=[Calcoli.B7]+0.25","v":1446.25},null,"K_PQ",{"$f":"of:=[Calcoli.E7]+0.25","v":1447.25},null,"K_PQ",{"$f":"of:=[Calcoli.H7]+0.25","v":1448.25},null,"K_PQ",{"$f":"of:=[Calcoli.K7]+0.25","v":1449.25},null,"K_PQ",{"$f":"of:=[Calcoli.N7]+0.25","v":1450.25},null,"K_PQ",{"$f":"of:=[Calcoli.Q7]+0.25","v":1451.25},null,"K_PQ",{"$f":"of:=[Calcoli.T7]+0.25","v":1452.25},null,"K_PQ",{"$f":"of:=[Calcoli.W7]+0.25","v":1453.25},null,"K_PQ",{"$f":"of:=[Calcoli.Z7]+0.25","v":1454.25},null,"K_PQ",{"$f":"of:=[Calcoli.AC7]+0.25","v":1455.25},null,"K_PQ",{"$f":"of:=[Calcoli.AF7]+0.25","v":1456.25},null,"K_PQ",{"$f":"of:=[Calcoli.AI7]+0.25","v":1457.25},null,"K_PQ",{"$f":"of:=[Calcoli.AL7]+0.25","v":1458.25},null,"K_PQ",{"$f":"of:=[Calcoli.AO7]+0.25","v":1460.25}]
["K_LP",{"$f":"of:=[Calcoli.B7]+0.5","v":1446.5},null,"K_LP",{"$f":"of:=[Calcoli.E7]+0.5","v":1447.5},null,"K_LP",{"$f":"of:=[Calcoli.H7]+0.5","v":1448.5},null,"K_LP",{"$f":"of:=[Calcoli.K7]+0.5","v":1449.5},null,"K_LP",{"$f":"of:=[Calcoli.N7]+0.5","v":1450.5},null,"K_LP",{"$f":"of:=[Calcoli.Q7]+0.5","v":1451.5},null,"K_LP",{"$f":"of:=[Calcoli.T7]+0.5","v":1452.5},null,"K_LP",{"$f":"of:=[Calcoli.W7]+0.5","v":1453.5},null,"K_LP",{"$f":"of:=[Calcoli.Z7]+0.5","v":1454.5},null,"K_LP",{"$f":"of:=[Calcoli.AC7]+0.5","v":1455.5},null,"K_LP",{"$f":"of:=[Calcoli.AF7]+0.5","v":1456.5},null,"K_LP",{"$f":"of:=[Calcoli.AI7]+0.5","v":1457.5},null,"K_LP",{"$f":"of:=[Calcoli.AL7]+0.5","v":1458.5},null,"K_LP",{"$f":"of:=[Calcoli.AO7]+0.5","v":1460.5}]
["K_UQ",{"$f":"of:=[Calcoli.B7]+0.75","v":1446.75},null,"K_UQ",{"$f":"of:=[Calcoli.E7]+0.75","v":1447.75},null,"K_UQ",{"$f":"of:=[Calcoli.H7]+0.75","v":1448.75},null,"K_UQ",{"$f":"of:=[Calcoli.K7]+0.75","v":1449.75},null,"K_UQ",{"$f":"of:=[Calcoli.N7]+0.75","v":1450.75},null,"K_UQ",{"$f":"of:=[Calcoli.Q7]+0.75","v":1451.75},null,"K_UQ",{"$f":"of:=[Calcoli.T7]+0.75","v":1452.75},null,"K_UQ",{"$f":"of:=[Calcoli.W7]+0.75","v":1453.75},null,"K_UQ",{"$f":"of:=[Calcoli.Z7]+0.75","v":1454.75},null,"K_UQ",{"$f":"of:=[Calcoli.AC7]+0.75","v":1455.75},null,"K_UQ",{"$f":"of:=[Calcoli.AF7]+0.75","v":1456.75},null,"K_UQ",{"$f":"of:=[Calcoli.AI7]+0.75","v":1457.75},null,"K_UQ",{"$f":"of:=[Calcoli.AL7]+0.75","v":1458.75},null,"K_UQ",{"$f":"of:=[Calcoli.AO7]+0.75","v":1460.75}]
["T_LN",{"$f":"of:=ROUND([Calcoli.B7]/1236.85;5)","v":1.1691},null,"T_LN",{"$f":"of:=ROUND([Calcoli.E7]/1236.85;5)","v":1.16991},null,"T_LN",{"$f":"of:=ROUND([Calcoli.H7]/1236.85;5)","v":1.17072},null,"T_LN",{"$f":"of:=ROUND([Calcoli.K7]/1236.85;5)","v":1.17152},null,"T_LN",{"$f":"of:=ROUND([Calcoli.N7]/1236.85;5)","v":1.17233},null,"T_LN",{"$f":"of:=ROUND([Calcoli.Q7]/1236.85;5)","v":1.17314},null,"T_LN",{"$f":"of:=ROUND([Calcoli.T7]/1236.85;5)","v":1.17395},null,"T_LN",{"$f":"of:=ROUND([Calcoli.W7]/1236.85;5)","v":1.17476},null,"T_LN",{"$f":"of:=ROUND([Calcoli.Z7]/1236.85;5)","v":1.17557},null,"T_LN",{"$f":"of:=ROUND([Calcoli.AC7]/1236.85;5)","v":1.17638},null,"T_LN",{"$f":"of:=ROUND([Calcoli.AF7]/1236.85;5)","v":1.17718},null,"T_LN",{"$f":"of:=ROUND([Calcoli.AI7]/1236.85;5)","v":1.17799},null,"T_LN",{"$f":"of:=ROUND([Calcoli.AL7]/1236.85;5)","v":1.1788},null,"T_LN",{"$f":"of:=ROUND([Calcoli.AO7]/1236.85;5)","v":1.18042}]
["T_PQ",{"$f":"of:=ROUND([Calcoli.B8]/1236.85;5)","v":1.1693},null,"T_PQ",{"$f":"of:=ROUND([Calcoli.E8]/1236.85;5)","v":1.17011},null,"T_PQ",{"$f":"of:=ROUND([Calcoli.H8]/1236.85;5)","v":1.17092},null,"T_PQ",{"$f":"of:=ROUND([Calcoli.K8]/1236.85;5)","v":1.17173},null,"T_PQ",{"$f":"of:=ROUND([Calcoli.N8]/1236.85;5)","v":1.17254},null,"T_PQ",{"$f":"of:=ROUND([Calcoli.Q8]/1236.85;5)","v":1.17334},null,"T_PQ",{"$f":"of:=ROUND([Calcoli.T8]/1236.85;5)","v":1.17415},null,"T_PQ",{"$f":"of:=ROUND([Calcoli.W8]/1236.85;5)","v":1.17496},null,"T_PQ",{"$f":"of:=ROUND([Calcoli.Z8]/1236.85;5)","v":1.17577},null,"T_PQ",{"$f":"of:=ROUND([Calcoli.AC8]/1236.85;5)","v":1.17658},null,"T_PQ",{"$f":"of:=ROUND([Calcoli.AF8]/1236.85;5)","v":1.17739},null,"T_PQ",{"$f":"of:=ROUND([Calcoli.AI8]/1236.85;5)","v":1.17819},null,"T_PQ",{"$f":"of:=ROUND([Calcoli.AL8]/1236.85;5)","v":1.179},null,"T_PQ",{"$f":"of:=ROUND([Calcoli.AO8]/1236.85;5)","v":1.18062}]
["T_LP",{"$f":"of:=ROUND([Calcoli.B9]/1236.85;5)","v":1.1695},null,"T_LP",{"$f":"of:=ROUND([Calcoli.E9]/1236.85;5)","v":1.17031},null,"T_LP",{"$f":"of:=ROUND([Calcoli.H9]/1236.85;5)","v":1.17112},null,"T_LP",{"$f":"of:=ROUND([Calcoli.K9]/1236.85;5)","v":1.17193},null,"T_LP",{"$f":"of:=ROUND([Calcoli.N9]/1236.85;5)","v":1.17274},null,"T_LP",{"$f":"of:=ROUND([Calcoli.Q9]/1236.85;5)","v":1.17355},null,"T_LP",{"$f":"of:=ROUND([Calcoli.T9]/1236.85;5)","v":1.17435},null,"T_LP",{"$f":"of:=ROUND([Calcoli.W9]/1236.85;5)","v":1.17516},null,"T_LP",{"$f":"of:=ROUND([Calcoli.Z9]/1236.85;5)","v":1.17597},null,"T_LP",{"$f":"of:=ROUND([Calcoli.AC9]/1236.85;5)","v":1.17678},null,"T_LP",{"$f":"of:=ROUND([Calcoli.AF9]/1236.85;5)","v":1.17759},null,"T_LP",{"$f":"of:=ROUND([Calcoli.AI9]/1236.85;5)","v":1.1784},null,"T_LP",{"$f":"of:=ROUND([Calcoli.AL9]/1236.85;5)","v":1.17921},null,"T_LP",{"$f":"of:=ROUND([Calcoli.AO9]/1236.85;5)","v":1.18082}]
["T_UQ",{"$f":"of:=ROUND([Calcoli.B10]/1236.85;5)","v":1.16971},null,"T_UQ",{"$f":"of:=ROUND([Calcoli.E10]/1236.85;5)","v":1.17051},null,"T_UQ",{"$f":"of:=ROUND([Calcoli.H10]/1236.85;5)","v":1.17132},null,"T_UQ",{"$f":"of:=ROUND([Calcoli.K10]/1236.85;5)","v":1.17213},null,"T_UQ",{"$f":"of:=ROUND([Calcoli.N10]/1236.85;5)","v":1.17294},null,"T_UQ",{"$f":"of:=ROUND([Calcoli.Q10]/1236.85;5)","v":1.17375},null,"T_UQ",{"$f":"of:=ROUND([Calcoli.T10]/1236.85;5)","v":1.17456},null,"T_UQ",{"$f":"of:=ROUND([Calcoli.W10]/1236.85;5)","v":1.17536},null,"T_UQ",{"$f":"of:=ROUND([Calcoli.Z10]/1236.85;5)","v":1.17617},null,"T_UQ",{"$f":"of:=ROUND([Calcoli.AC10]/1236.85;5)","v":1.17698},null,"T_UQ",{"$f":"of:=ROUND([Calcoli.AF10]/1236.85;5)","v":1.17779},null,"T_UQ",{"$f":"of:=ROUND([Calcoli.AI10]/1236.85;5)","v":1.1786},null,"T_UQ",{"$f":"of:=ROUND([Calcoli.AL10]/1236.85;5)","v":1.17941},null,"T_UQ",{"$f":"of:=ROUND([Calcoli.AO10]/1236.85;5)","v":1.18102}]
["JD_LN",{"$f":"of:=ROUND(2415020.75933+29.53058868*[Calcoli.B7]+0.0001178*[Calcoli.B11]^2-0.000000155*[Calcoli.B11]^3+0.00033*SIN(166.56+132.87*[Calcoli.B11]-0.009*173*[Calcoli.B11]^2);4)","v":2457721.9905},null,"JD_LN",{"$f":"of:=ROUND(2415020.75933+29.53058868*[Calcoli.E7]+0.0001178*[Calcoli.E11]^2-0.000000155*[Calcoli.E11]^3+0.00033*SIN(166.56+132.87*[Calcoli.E11]-0.009*173*[Calcoli.E11]^2);4)","v":2457751.5211},null,"JD_LN",{"$f":"of:=ROUND(2415020.75933+29.53058868*[Calcoli.H7]+0.0001178*[Calcoli.H11]^2-0.000000155*[Calcoli.H11]^3+0.00033*SIN(166.56+132.87*[Calcoli.H11]-0.009*173*[Calcoli.H11]^2);4)","v":2457781.0518},null,"JD_LN",{"$f":"of:=ROUND(2415020.75933+29.53058868*[Calcoli.K7]+0.0001178*[Calcoli.K11]^2-0.000000155*[Calcoli.K11]^3+0.00033*SIN(166.56+132.87*[Calcoli.K11]-0.009*173*[Calcoli.K11]^2);4)","v":2457810.5824},null,"JD_LN",{"$f":"of:=ROUND(2415020.75933+29.53058868*[Calcoli.N7]+0.0001178*[Calcoli.N11]^2-0.000000155*[Calcoli.N11]^3+0.00033*SIN(166.56+132.87*[Calcoli.N11]-0.009*173*[Calcoli.N11]^2);4)","v":2457840.113},null,"JD_LN",{"$f":"of:=ROUND(2415020.75933+29.53058868*[Calcoli.Q7]+0.0001178*[Calcoli.Q11]^2-0.000000155*[Calcoli.Q11]^3+0.00033*SIN(166.56+132.87*[Calcoli.Q11]-0.009*173*[Calcoli.Q11]^2);4)","v":2457869.6436},null,"JD_LN",{"$f":"of:=ROUND(2415020.75933+29.53058868*[Calcoli.T7]+0.0001178*[Calcoli.T11]^2-0.000000155*[Calcoli.T11]^3+0.00033*SIN(166.56+132.87*[Calcoli.T11]-0.009*173*[Calcoli.T11]^2);4)","v":2457899.1742},null,"JD_LN",{"$f":"of:=ROUND(2415020.75933+29.53058868*[Calcoli.W7]+0.0001178*[Calcoli.W11]^2-0.000000155*[Calcoli.W11]^3+0.00033*SIN(166.56+132.87*[Calcoli.W11]-0.009*173*[Calcoli.W11]^2);4)","v":2457928.7049},null,"JD_LN",{"$f":"of:=ROUND(2415020.75933+29.53058868*[Calcoli.Z7]+0.0001178*[Calcoli.Z11]^2-0.000000155*[Calcoli.Z11]^3+0.00033*SIN(166.56+132.87*[Calcoli.Z11]-0.009*173*[Calcoli.Z11]^2);4)","v":2457958.2355},null,"JD_LN",{"$f":"of:=ROUND(2415020.75933+29.53058868*[Calcoli.AC7]+0.0001178*[Calcoli.AC11]^2-0.000000155*[Calcoli.AC11]^3+0.00033*SIN(166.56+132.87*[Calcoli.AC11]-0.009*173*[Calcoli.AC11]^2);4)","v":2457987.7661},null,"JD_LN",{"$f":"of:=ROUND(2415020.75933+29.53058868*[Calcoli.AF7]+0.0001178*[Calcoli.AF11]^2-0.000000155*[Calcoli.AF11]^3+0.00033*SIN(166.56+132.87*[Calcoli.AF11]-0.009*173*[Calcoli.AF11]^2);4)","v":2458017.2967},null,"JD_LN",{"$f":"of:=ROUND(2415020.75933+29.53058868*[Calcoli.AI7]+0.0001178*[Calcoli.AI11]^2-0.000000155*[Calcoli.AI11]^3+0.00033*SIN(166.56+132.87*[Calcoli.AI11]-0.009*173*[Calcoli.AI11]^2);4)","v":2458046.8274},null,"JD_LN",{"$f":"of:=ROUND(2415020.75933+29.53058868*[Calcoli.AL7]+0.0001178*[Calcoli.AL11]^2-0.000000155*[Calcoli.AL11]^3+0.00033*SIN(166.56+132.87*[Calcoli.AL11]-0.009*173*[Calcoli.AL11]^2);4)","v":2458076.358},null,"JD_LN",{"$f":"of:=ROUND(2415020.75933+29.53058868*[Calcoli.AO7]+0.0001178*[Calcoli.AO11]^2-0.000000155*[Calcoli.AO11]^3+0.00033*SIN(166.56+132.87*[Calcoli.AO11]-0.009*173*[Calcoli.AO11]^2);4)","v":2458135.4192}]
["JD_PQ",{"$f":"of:=ROUND(2415020.75933+29.53058868*[Calcoli.B8]+0.0001178*[Calcoli.B12]^2-0.000000155*[Calcoli.B12]^3+0.00033*SIN(166.56+132.87*[Calcoli.B12]-0.009*173*[Calcoli.B12]^2);4)","v":2457729.3732},null,"JD_PQ",{"$f":"of:=ROUND(2415020.75933+29.53058868*[Calcoli.E8]+0.0001178*[Calcoli.E12]^2-0.000000155*[Calcoli.E12]^3+0.00033*SIN(166.56+132.87*[Calcoli.E12]-0.009*173*[Calcoli.E12]^2);4)","v":2457758.9038},null,"JD_PQ",{"$f":"of:=ROUND(2415020.75933+29.53058868*[Calcoli.H8]+0.0001178*[Calcoli.H12]^2-0.000000155*[Calcoli.H12]^3+0.00033*SIN(166.56+132.87*[Calcoli.H12]-0.009*173*[Calcoli.H12]^2);4)","v":2457788.4344},null,"JD_PQ",{"$f":"of:=ROUND(2415020.75933+29.53058868*[Calcoli.K8]+0.0001178*[Calcoli.K12]^2-0.000000155*[Calcoli.K12]^3+0.00033*SIN(166.56+132.87*[Calcoli.K12]-0.009*173*[Calcoli.K12]^2);4)","v":2457817.965},null,"JD_PQ",{"$f":"of:=ROUND(2415020.75933+29.53058868*[Calcoli.N8]+0.0001178*[Calcoli.N12]^2-0.000000155*[Calcoli.N12]^3+0.00033*SIN(166.56+132.87*[Calcoli.N12]-0.009*173*[Calcoli.N12]^2);4)","v":2457847.4957},null,"JD_PQ",{"$f":"of:=ROUND(2415020.75933+29.53058868*[Calcoli.Q8]+0.0001178*[Calcoli.Q12]^2-0.000000155*[Calcoli.Q12]^3+0.00033*SIN(166.56+132.87*[Calcoli.Q12]-0.009*173*[Calcoli.Q12]^2);4)","v":2457877.0263},null,"JD_PQ",{"$f":"of:=ROUND(2415020.75933+29.53058868*[Calcoli.T8]+0.0001178*[Calcoli.T12]^2-0.000000155*[Calcoli.T12]^3+0.00033*SIN(166.56+132.87*[Calcoli.T12]-0.009*173*[Calcoli.T12]^2);4)","v":2457906.5569},null,"JD_PQ",{"$f":"of:=ROUND(2415020.75933+29.53058868*[Calcoli.W8]+0.0001178*[Calcoli.W12]^2-0.000000155*[Calcoli.W12]^3+0.00033*SIN(166.56+132.87*[Calcoli.W12]-0.009*173*[Calcoli.W12]^2);4)","v":2457936.0875},null,"JD_PQ",{"$f":"of:=ROUND(2415020.75933+29.53058868*[Calcoli.Z8]+0.0001178*[Calcoli.Z12]^2-0.000000155*[Calcoli.Z12]^3+0.00033*SIN(166.56+132.87*[Calcoli.Z12]-0.009*173*[Calcoli.Z12]^2);4)","v":2457965.6181},null,"JD_PQ",{"$f":"of:=ROUND(2415020.75933+29.53058868*[Calcoli.AC8]+0.0001178*[Calcoli.AC12]^2-0.000000155*[Calcoli.AC12]^3+0.00033*SIN(166.56+132.87*[Calcoli.AC12]-0.009*173*[Calcoli.AC12]^2);4)","v":2457995.1488},null,"JD_PQ",{"$f":"of:=ROUND(2415020.75933+29.53058868*[Calcoli.AF8]+0.0001178*[Calcoli.AF12]^2-0.000000155*[Calcoli.AF12]^3+0.00033*SIN(166.56+132.87*[Calcoli.AF12]-0.009*173*[Calcoli.AF12]^2);4)","v":2458024.6794},null,"JD_PQ",{"$f":"of:=ROUND(2415020.75933+29.53058868*[Calcoli.AI8]+0.0001178*[Calcoli.AI12]^2-0.000000155*[Calcoli.AI12]^3+0.00033*SIN(166.56+132.87*[Calcoli.AI12]-0.009*173*[Calcoli.AI12]^2);4)","v":2458054.21},null,"JD_PQ",{"$f":"of:=ROUND(2415020.75933+29.53058868*[Calcoli.AL8]+0.0001178*[Calcoli.AL12]^2-0.000000155*[Calcoli.AL12]^3+0.00033*SIN(166.56+132.87*[Calcoli.AL12]-0.009*173*[Calcoli.AL12]^2);4)","v":2458083.7406},null,"JD_PQ",{"$f":"of:=ROUND(2415020.75933+29.53058868*[Calcoli.AO8]+0.0001178*[Calcoli.AO12]^2-0.000000155*[Calcoli.AO12]^3+0.00033*SIN(166.56+132.87*[Calcoli.AO12]-0.009*173*[Calcoli.AO12]^2);4)","v":2458142.8019}]
["JD_LP",{"$f":"of:=ROUND(2415020.75933+29.53058868*[Calcoli.B9]+0.0001178*[Calcoli.B13]^2-0.000000155*[Calcoli.B13]^3+0.00033*SIN(166.56+132.87*[Calcoli.B13]-0.009*173*[Calcoli.B13]^2);4)","v":2457736.7558},null,"JD_LP",{"$f":"of:=ROUND(2415020.75933+29.53058868*[Calcoli.E9]+0.0001178*[Calcoli.E13]^2-0.000000155*[Calcoli.E13]^3+0.00033*SIN(166.56+132.87*[Calcoli.E13]-0.009*173*[Calcoli.E13]^2);4)","v":2457766.2864},null,"JD_LP",{"$f":"of:=ROUND(2415020.75933+29.53058868*[Calcoli.H9]+0.0001178*[Calcoli.H13]^2-0.000000155*[Calcoli.H13]^3+0.00033*SIN(166.56+132.87*[Calcoli.H13]-0.009*173*[Calcoli.H13]^2);4)","v":2457795.8171},null,"JD_LP",{"$f":"of:=ROUND(2415020.75933+29.53058868*[Calcoli.K9]+0.0001178*[Calcoli.K13]^2-0.000000155*[Calcoli.K13]^3+0.00033*SIN(166.56+132.87*[Calcoli.K13]-0.009*173*[Calcoli.K13]^2);4)","v":2457825.3477},null,"JD_LP",{"$f":"of:=ROUND(2415020.75933+29.53058868*[Calcoli.N9]+0.0001178*[Calcoli.N13]^2-0.000000155*[Calcoli.N13]^3+0.00033*SIN(166.56+132.87*[Calcoli.N13]-0.009*173*[Calcoli.N13]^2);4)","v":2457854.8783},null,"JD_LP",{"$f":"of:=ROUND(2415020.75933+29.53058868*[Calcoli.Q9]+0.0001178*[Calcoli.Q13]^2-0.000000155*[Calcoli.Q13]^3+0.00033*SIN(166.56+132.87*[Calcoli.Q13]-0.009*173*[Calcoli.Q13]^2);4)","v":2457884.4089},null,"JD_LP",{"$f":"of:=ROUND(2415020.75933+29.53058868*[Calcoli.T9]+0.0001178*[Calcoli.T13]^2-0.000000155*[Calcoli.T13]^3+0.00033*SIN(166.56+132.87*[Calcoli.T13]-0.009*173*[Calcoli.T13]^2);4)","v":2457913.9396},null,"JD_LP",{"$f":"of:=ROUND(2415020.75933+29.53058868*[Calcoli.W9]+0.0001178*[Calcoli.W13]^2-0.000000155*[Calcoli.W13]^3+0.00033*SIN(166.56+132.87*[Calcoli.W13]-0.009*173*[Calcoli.W13]^2);4)","v":2457943.4702},null,"JD_LP",{"$f":"of:=ROUND(2415020.75933+29.53058868*[Calcoli.Z9]+0.0001178*[Calcoli.Z13]^2-0.000000155*[Calcoli.Z13]^3+0.00033*SIN(166.56+132.87*[Calcoli.Z13]-0.009*173*[Calcoli.Z13]^2);4)","v":2457973.0008},null,"JD_LP",{"$f":"of:=ROUND(2415020.75933+29.53058868*[Calcoli.AC9]+0.0001178*[Calcoli.AC13]^2-0.000000155*[Calcoli.AC13]^3+0.00033*SIN(166.56+132.87*[Calcoli.AC13]-0.009*173*[Calcoli.AC13]^2);4)","v":2458002.5314},null,"JD_LP",{"$f":"of:=ROUND(2415020.75933+29.53058868*[Calcoli.AF9]+0.0001178*[Calcoli.AF13]^2-0.000000155*[Calcoli.AF13]^3+0.00033*SIN(166.56+132.87*[Calcoli.AF13]-0.009*173*[Calcoli.AF13]^2);4)","v":2458032.062},null,"JD_LP",{"$f":"of:=ROUND(2415020.75933+29.53058868*[Calcoli.AI9]+0.0001178*[Calcoli.AI13]^2-0.000000155*[Calcoli.AI13]^3+0.00033*SIN(166.56+132.87*[Calcoli.AI13]-0.009*173*[Calcoli.AI13]^2);4)","v":2458061.5927},null,"JD_LP",{"$f":"of:=ROUND(2415020.75933+29.53058868*[Calcoli.AL9]+0.0001178*[Calcoli.AL13]^2-0.000000155*[Calcoli.AL13]^3+0.00033*SIN(166.56+132.87*[Calcoli.AL13]-0.009*173*[Calcoli.AL13]^2);4)","v":2458091.1233},null,"JD_LP",{"$f":"of:=ROUND(2415020.75933+29.53058868*[Calcoli.AO9]+0.0001178*[Calcoli.AO13]^2-0.000000155*[Calcoli.AO13]^3+0.00033*SIN(166.56+132.87*[Calcoli.AO13]-0.009*173*[Calcoli.AO13]^2);4)","v":2458150.1845}]
["JD_UQ",{"$f":"of:=ROUND(2415020.75933+29.53058868*[Calcoli.B10]+0.0001178*[Calcoli.B14]^2-0.000000155*[Calcoli.B14]^3+0.00033*SIN(166.56+132.87*[Calcoli.B14]-0.009*173*[Calcoli.B14]^2);4)","v":2457744.1385},null,"JD_UQ",{"$f":"of:=ROUND(2415020.75933+29.53058868*[Calcoli.E10]+0.0001178*[Calcoli.E14]^2-0.000000155*[Calcoli.E14]^3+0.00033*SIN(166.56+132.87*[Calcoli.E14]-0.009*173*[Calcoli.E14]^2);4)","v":2457773.6691},null,"JD_UQ",{"$f":"of:=ROUND(2415020.75933+29.53058868*[Calcoli.H10]+0.0001178*[Calcoli.H14]^2-0.000000155*[Calcoli.H14]^3+0.00033*SIN(166.56+132.87*[Calcoli.H14]-0.009*173*[Calcoli.H14]^2);4)","v":2457803.1997},null,"JD_UQ",{"$f":"of:=ROUND(2415020.75933+29.53058868*[Calcoli.K10]+0.0001178*[Calcoli.K14]^2-0.000000155*[Calcoli.K14]^3+0.00033*SIN(166.56+132.87*[Calcoli.K14]-0.009*173*[Calcoli.K14]^2);4)","v":2457832.7303},null,"JD_UQ",{"$f":"of:=ROUND(2415020.75933+29.53058868*[Calcoli.N10]+0.0001178*[Calcoli.N14]^2-0.000000155*[Calcoli.N14]^3+0.00033*SIN(166.56+132.87*[Calcoli.N14]-0.009*173*[Calcoli.N14]^2);4)","v":2457862.261},null,"JD_UQ",{"$f":"of:=ROUND(2415020.75933+29.53058868*[Calcoli.Q10]+0.0001178*[Calcoli.Q14]^2-0.000000155*[Calcoli.Q14]^3+0.00033*SIN(166.56+132.87*[Calcoli.Q14]-0.009*173*[Calcoli.Q14]^2);4)","v":2457891.7916},null,"JD_UQ",{"$f":"of:=ROUND(2415020.75933+29.53058868*[Calcoli.T10]+0.0001178*[Calcoli.T14]^2-0.000000155*[Calcoli.T14]^3+0.00033*SIN(166.56+132.87*[Calcoli.T14]-0.009*173*[Calcoli.T14]^2);4)","v":2457921.3222},null,"JD_UQ",{"$f":"of:=ROUND(2415020.75933+29.53058868*[Calcoli.W10]+0.0001178*[Calcoli.W14]^2-0.000000155*[Calcoli.W14]^3+0.00033*SIN(166.56+132.87*[Calcoli.W14]-0.009*173*[Calcoli.W14]^2);4)","v":2457950.8528},null,"JD_UQ",{"$f":"of:=ROUND(2415020.75933+29.53058868*[Calcoli.Z10]+0.0001178*[Calcoli.Z14]^2-0.000000155*[Calcoli.Z14]^3+0.00033*SIN(166.56+132.87*[Calcoli.Z14]-0.009*173*[Calcoli.Z14]^2);4)","v":2457980.3835},null,"JD_UQ",{"$f":"of:=ROUND(2415020.75933+29.53058868*[Calcoli.AC10]+0.0001178*[Calcoli.AC14]^2-0.000000155*[Calcoli.AC14]^3+0.00033*SIN(166.56+132.87*[Calcoli.AC14]-0.009*173*[Calcoli.AC14]^2);4)","v":2458009.9141},null,"JD_UQ",{"$f":"of:=ROUND(2415020.75933+29.53058868*[Calcoli.AF10]+0.0001178*[Calcoli.AF14]^2-0.000000155*[Calcoli.AF14]^3+0.00033*SIN(166.56+132.87*[Calcoli.AF14]-0.009*173*[Calcoli.AF14]^2);4)","v":2458039.4447},null,"JD_UQ",{"$f":"of:=ROUND(2415020.75933+29.53058868*[Calcoli.AI10]+0.0001178*[Calcoli.AI14]^2-0.000000155*[Calcoli.AI14]^3+0.00033*SIN(166.56+132.87*[Calcoli.AI14]-0.009*173*[Calcoli.AI14]^2);4)","v":2458068.9753},null,"JD_UQ",{"$f":"of:=ROUND(2415020.75933+29.53058868*[Calcoli.AL10]+0.0001178*[Calcoli.AL14]^2-0.000000155*[Calcoli.AL14]^3+0.00033*SIN(166.56+132.87*[Calcoli.AL14]-0.009*173*[Calcoli.AL14]^2);4)","v":2458098.5059},null,"JD_UQ",{"$f":"of:=ROUND(2415020.75933+29.53058868*[Calcoli.AO10]+0.0001178*[Calcoli.AO14]^2-0.000000155*[Calcoli.AO14]^3+0.00033*SIN(166.56+132.87*[Calcoli.AO14]-0.009*173*[Calcoli.AO14]^2);4)","v":2458157.5672}]
["M_LN",{"$f":"of:=ROUND(359.2242+29.10535608*[Calcoli.B7]-0.0000333*[Calcoli.B11]^2-0.00000347*[Calcoli.B11]^3;4)","v":42445.569},null,"M_LN",{"$f":"of:=ROUND(359.2242+29.10535608*[Calcoli.E7]-0.0000333*[Calcoli.E11]^2-0.00000347*[Calcoli.E11]^3;4)","v":42474.6744},null,"M_LN",{"$f":"of:=ROUND(359.2242+29.10535608*[Calcoli.H7]-0.0000333*[Calcoli.H11]^2-0.00000347*[Calcoli.H11]^3;4)","v":42503.7798},null,"M_LN",{"$f":"of:=ROUND(359.2242+29.10535608*[Calcoli.K7]-0.0000333*[Calcoli.K11]^2-0.00000347*[Calcoli.K11]^3;4)","v":42532.8851},null,"M_LN",{"$f":"of:=ROUND(359.2242+29.10535608*[Calcoli.N7]-0.0000333*[Calcoli.N11]^2-0.00000347*[Calcoli.N11]^3;4)","v":42561.9905},null,"M_LN",{"$f":"of:=ROUND(359.2242+29.10535608*[Calcoli.Q7]-0.0000333*[Calcoli.Q11]^2-0.00000347*[Calcoli.Q11]^3;4)","v":42591.0958},null,"M_LN",{"$f":"of:=ROUND(359.2242+29.10535608*[Calcoli.T7]-0.0000333*[Calcoli.T11]^2-0.00000347*[Calcoli.T11]^3;4)","v":42620.2012},null,"M_LN",{"$f":"of:=ROUND(359.2242+29.10535608*[Calcoli.W7]-0.0000333*[Calcoli.W11]^2-0.00000347*[Calcoli.W11]^3;4)","v":42649.3065},null,"M_LN",{"$f":"of:=ROUND(359.2242+29.10535608*[Calcoli.Z7]-0.0000333*[Calcoli.Z11]^2-0.00000347*[Calcoli.Z11]^3;4)","v":42678.4119},null,"M_LN",{"$f":"of:=ROUND(359.2242+29.10535608*[Calcoli.AC7]-0.0000333*[Calcoli.AC11]^2-0.00000347*[Calcoli.AC11]^3;4)","v":42707.5172},null,"M_LN",{"$f":"of:=ROUND(359.2242+29.10535608*[Calcoli.AF7]-0.0000333*[Calcoli.AF11]^2-0.00000347*[Calcoli.AF11]^3;4)","v":42736.6226},null,"M_LN",{"$f":"of:=ROUND(359.2242+29.10535608*[Calcoli.AI7]-0.0000333*[Calcoli.AI11]^2-0.00000347*[Calcoli.AI11]^3;4)","v":42765.728},null,"M_LN",{"$f":"of:=ROUND(359.2242+29.10535608*[Calcoli.AL7]-0.0000333*[Calcoli.AL11]^2-0.00000347*[Calcoli.AL11]^3;4)","v":42794.8333},null,"M_LN",{"$f":"of:=ROUND(359.2242+29.10535608*[Calcoli.AO7]-0.0000333*[Calcoli.AO11]^2-0.00000347*[Calcoli.AO11]^3;4)","v":42853.044}]
["M_a",{"$f":"of:=ROUND(INT([Calcoli.B19])-(INT(INT([Calcoli.B19])/360))*360+[Calcoli.B19]-INT([Calcoli.B19]);4)","v":325.569},null,"M_a",{"$f":"of:=ROUND(INT([Calcoli.E19])-(INT(INT([Calcoli.E19])/360))*360+[Calcoli.E19]-INT([Calcoli.E19]);4)","v":354.6744},null,"M_a",{"$f":"of:=ROUND(INT([Calcoli.H19])-(INT(INT([Calcoli.H19])/360))*360+[Calcoli.H19]-INT([Calcoli.H19]);4)","v":23.7798},null,"M_a",{"$f":"of:=ROUND(INT([Calcoli.K19])-(INT(INT([Calcoli.K19])/360))*360+[Calcoli.K19]-INT([Calcoli.K19]);4)","v":52.8851},null,"M_a",{"$f":"of:=ROUND(INT([Calcoli.N19])-(INT(INT([Calcoli.N19])/360))*360+[Calcoli.N19]-INT([Calcoli.N19]);4)","v":81.9905},null,"M_a",{"$f":"of:=ROUND(INT([Calcoli.Q19])-(INT(INT([Calcoli.Q19])/360))*360+[Calcoli.Q19]-INT([Calcoli.Q19]);4)","v":111.0958},null,"M_a",{"$f":"of:=ROUND(INT([Calcoli.T19])-(INT(INT([Calcoli.T19])/360))*360+[Calcoli.T19]-INT([Calcoli.T19]);4)","v":140.2012},null,"M_a",{"$f":"of:=ROUND(INT([Calcoli.W19])-(INT(INT([Calcoli.W19])/360))*360+[Calcoli.W19]-INT([Calcoli.W19]);4)","v":169.3065},null,"M_a",{"$f":"of:=ROUND(INT([Calcoli.Z19])-(INT(INT([Calcoli.Z19])/360))*360+[Calcoli.Z19]-INT([Calcoli.Z19]);4)","v":198.4119},null,"M_a",{"$f":"of:=ROUND(INT([Calcoli.AC19])-(INT(INT([Calcoli.AC19])/360))*360+[Calcoli.AC19]-INT([Calcoli.AC19]);4)","v":227.5172},null,"M_a",{"$f":"of:=ROUND(INT([Calcoli.AF19])-(INT(INT([Calcoli.AF19])/360))*360+[Calcoli.AF19]-INT([Calcoli.AF19]);4)","v":256.6226},null,"M_a",{"$f":"of:=ROUND(INT([Calcoli.AI19])-(INT(INT([Calcoli.AI19])/360))*360+[Calcoli.AI19]-INT([Calcoli.AI19]);4)","v":285.728},null,"M_a",{"$f":"of:=ROUND(INT([Calcoli.AL19])-(INT(INT([Calcoli.AL19])/360))*360+[Calcoli.AL19]-INT([Calcoli.AL19]);4)","v":314.8333},null,"M_a",{"$f":"of:=ROUND(INT([Calcoli.AO19])-(INT(INT([Calcoli.AO19])/360))*360+[Calcoli.AO19]-INT([Calcoli.AO19]);4)","v":13.044}]
["M_PQ",{"$f":"of:=ROUND(359.2242+29.10535608*[Calcoli.B8]-0.0000333*[Calcoli.B12]^2-0.00000347*[Calcoli.B12]^3;4)","v":42452.8454},null,"M_PQ",{"$f":"of:=ROUND(359.2242+29.10535608*[Calcoli.E8]-0.0000333*[Calcoli.E12]^2-0.00000347*[Calcoli.E12]^3;4)","v":42481.9507},null,"M_PQ",{"$f":"of:=ROUND(359.2242+29.10535608*[Calcoli.H8]-0.0000333*[Calcoli.H12]^2-0.00000347*[Calcoli.H12]^3;4)","v":42511.0561},null,"M_PQ",{"$f":"of:=ROUND(359.2242+29.10535608*[Calcoli.K8]-0.0000333*[Calcoli.K12]^2-0.00000347*[Calcoli.K12]^3;4)","v":42540.1614},null,"M_PQ",{"$f":"of:=ROUND(359.2242+29.10535608*[Calcoli.N8]-0.0000333*[Calcoli.N12]^2-0.00000347*[Calcoli.N12]^3;4)","v":42569.2668},null,"M_PQ",{"$f":"of:=ROUND(359.2242+29.10535608*[Calcoli.Q8]-0.0000333*[Calcoli.Q12]^2-0.00000347*[Calcoli.Q12]^3;4)","v":42598.3722},null,"M_PQ",{"$f":"of:=ROUND(359.2242+29.10535608*[Calcoli.T8]-0.0000333*[Calcoli.T12]^2-0.00000347*[Calcoli.T12]^3;4)","v":42627.4775},null,"M_PQ",{"$f":"of:=ROUND(359.2242+29.10535608*[Calcoli.W8]-0.0000333*[Calcoli.W12]^2-0.00000347*[Calcoli.W12]^3;4)","v":42656.5829},null,"M_PQ",{"$f":"of:=ROUND(359.2242+29.10535608*[Calcoli.Z8]-0.0000333*[Calcoli.Z12]^2-0.00000347*[Calcoli.Z12]^3;4)","v":42685.6882},null,"M_PQ",{"$f":"of:=ROUND(359.2242+29.10535608*[Calcoli.AC8]-0.0000333*[Calcoli.AC12]^2-0.00000347*[Calcoli.AC12]^3;4)","v":42714.7936},null,"M_PQ",{"$f":"of:=ROUND(359.2242+29.10535608*[Calcoli.AF8]-0.0000333*[Calcoli.AF12]^2-0.00000347*[Calcoli.AF12]^3;4)","v":42743.8989},null,"M_PQ",{"$f":"of:=ROUND(359.2242+29.10535608*[Calcoli.AI8]-0.0000333*[Calcoli.AI12]^2-0.00000347*[Calcoli.AI12]^3;4)","v":42773.0043},null,"M_PQ",{"$f":"of:=ROUND(359.2242+29.10535608*[Calcoli.AL8]-0.0000333*[Calcoli.AL12]^2-0.00000347*[Calcoli.AL12]^3;4)","v":42802.1097},null,"M_PQ",{"$f":"of:=ROUND(359.2242+29.10535608*[Calcoli.AO8]-0.0000333*[Calcoli.AO12]^2-0.00000347*[Calcoli.AO12]^3;4)","v":42860.3204}]
["M_LP",{"$f":"of:=ROUND(359.2242+29.10535608*[Calcoli.B9]-0.0000333*[Calcoli.B13]^2-0.00000347*[Calcoli.B13]^3;4)","v":42460.1217},null,"M_LP",{"$f":"of:=ROUND(359.2242+29.10535608*[Calcoli.E9]-0.0000333*[Calcoli.E13]^2-0.00000347*[Calcoli.E13]^3;4)","v":42489.2271},null,"M_LP",{"$f":"of:=ROUND(359.2242+29.10535608*[Calcoli.H9]-0.0000333*[Calcoli.H13]^2-0.00000347*[Calcoli.H13]^3;4)","v":42518.3324},null,"M_LP",{"$f":"of:=ROUND(359.2242+29.10535608*[Calcoli.K9]-0.0000333*[Calcoli.K13]^2-0.00000347*[Calcoli.K13]^3;4)","v":42547.4378},null,"M_LP",{"$f":"of:=ROUND(359.2242+29.10535608*[Calcoli.N9]-0.0000333*[Calcoli.N13]^2-0.00000347*[Calcoli.N13]^3;4)","v":42576.5431},null,"M_LP",{"$f":"of:=ROUND(359.2242+29.10535608*[Calcoli.Q9]-0.0000333*[Calcoli.Q13]^2-0.00000347*[Calcoli.Q13]^3;4)","v":42605.6485},null,"M_LP",{"$f":"of:=ROUND(359.2242+29.10535608*[Calcoli.T9]-0.0000333*[Calcoli.T13]^2-0.00000347*[Calcoli.T13]^3;4)","v":42634.7539},null,"M_LP",{"$f":"of:=ROUND(359.2242+29.10535608*[Calcoli.W9]-0.0000333*[Calcoli.W13]^2-0.00000347*[Calcoli.W13]^3;4)","v":42663.8592},null,"M_LP",{"$f":"of:=ROUND(359.2242+29.10535608*[Calcoli.Z9]-0.0000333*[Calcoli.Z13]^2-0.00000347*[Calcoli.Z13]^3;4)","v":42692.9646},null,"M_LP",{"$f":"of:=ROUND(359.2242+29.10535608*[Calcoli.AC9]-0.0000333*[Calcoli.AC13]^2-0.00000347*[Calcoli.AC13]^3;4)","v":42722.0699},null,"M_LP",{"$f":"of:=ROUND(359.2242+29.10535608*[Calcoli.AF9]-0.0000333*[Calcoli.AF13]^2-0.00000347*[Calcoli.AF13]^3;4)","v":42751.1753},null,"M_LP",{"$f":"of:=ROUND(359.2242+29.10535608*[Calcoli.AI9]-0.0000333*[Calcoli.AI13]^2-0.00000347*[Calcoli.AI13]^3;4)","v":42780.2806},null,"M_LP",{"$f":"of:=ROUND(359.2242+29.10535608*[Calcoli.AL9]-0.0000333*[Calcoli.AL13]^2-0.00000347*[Calcoli.AL13]^3;4)","v":42809.386},null,"M_LP",{"$f":"of:=ROUND(359.2242+29.10535608*[Calcoli.AO9]-0.0000333*[Calcoli.AO13]^2-0.00000347*[Calcoli.AO13]^3;4)","v":42867.5967}]
["M_UQ",{"$f":"of:=ROUND(359.2242+29.10535608*[Calcoli.B10]-0.0000333*[Calcoli.B14]^2-0.00000347*[Calcoli.B14]^3;4)","v":42467.3981},null,"M_UQ",{"$f":"of:=ROUND(359.2242+29.10535608*[Calcoli.E10]-0.0000333*[Calcoli.E14]^2-0.00000347*[Calcoli.E14]^3;4)","v":42496.5034},null,"M_UQ",{"$f":"of:=ROUND(359.2242+29.10535608*[Calcoli.H10]-0.0000333*[Calcoli.H14]^2-0.00000347*[Calcoli.H14]^3;4)","v":42525.6088},null,"M_UQ",{"$f":"of:=ROUND(359.2242+29.10535608*[Calcoli.K10]-0.0000333*[Calcoli.K14]^2-0.00000347*[Calcoli.K14]^3;4)","v":42554.7141},null,"M_UQ",{"$f":"of:=ROUND(359.2242+29.10535608*[Calcoli.N10]-0.0000333*[Calcoli.N14]^2-0.00000347*[Calcoli.N14]^3;4)","v":42583.8195},null,"M_UQ",{"$f":"of:=ROUND(359.2242+29.10535608*[Calcoli.Q10]-0.0000333*[Calcoli.Q14]^2-0.00000347*[Calcoli.Q14]^3;4)","v":42612.9248},null,"M_UQ",{"$f":"of:=ROUND(359.2242+29.10535608*[Calcoli.T10]-0.0000333*[Calcoli.T14]^2-0.00000347*[Calcoli.T14]^3;4)","v":42642.0302},null,"M_UQ",{"$f":"of:=ROUND(359.2242+29.10535608*[Calcoli.W10]-0.0000333*[Calcoli.W14]^2-0.00000347*[Calcoli.W14]^3;4)","v":42671.1355},null,"M_UQ",{"$f":"of:=ROUND(359.2242+29.10535608*[Calcoli.Z10]-0.0000333*[Calcoli.Z14]^2-0.00000347*[Calcoli.Z14]^3;4)","v":42700.2409},null,"M_UQ",{"$f":"of:=ROUND(359.2242+29.10535608*[Calcoli.AC10]-0.0000333*[Calcoli.AC14]^2-0.00000347*[Calcoli.AC14]^3;4)","v":42729.3463},null,"M_UQ",{"$f":"of:=ROUND(359.2242+29.10535608*[Calcoli.AF10]-0.0000333*[Calcoli.AF14]^2-0.00000347*[Calcoli.AF14]^3;4)","v":42758.4516},null,"M_UQ",{"$f":"of:=ROUND(359.2242+29.10535608*[Calcoli.AI10]-0.0000333*[Calcoli.AI14]^2-0.00000347*[Calcoli.AI14]^3;4)","v":42787.557},null,"M_UQ",{"$f":"of:=ROUND(359.2242+29.10535608*[Calcoli.AL10]-0.0000333*[Calcoli.AL14]^2-0.00000347*[Calcoli.AL14]^3;4)","v":42816.6623},null,"M_UQ",{"$f":"of:=ROUND(359.2242+29.10535608*[Calcoli.AO10]-0.0000333*[Calcoli.AO14]^2-0.00000347*[Calcoli.AO14]^3;4)","v":42874.873}]
["M1_LN",{"$f":"of:=ROUND(306.0253+385.81691806*[Calcoli.B7]+0.0107306*[Calcoli.B11]^2+0.00001236*[Calcoli.B11]^3;4)","v":558197.3035},null,"M1_LN",{"$f":"of:=ROUND(306.0253+385.81691806*[Calcoli.E7]+0.0107306*[Calcoli.E11]^2+0.00001236*[Calcoli.E11]^3;4)","v":558583.1204},null,"M1_LN",{"$f":"of:=ROUND(306.0253+385.81691806*[Calcoli.H7]+0.0107306*[Calcoli.H11]^2+0.00001236*[Calcoli.H11]^3;4)","v":558968.9374},null,"M1_LN",{"$f":"of:=ROUND(306.0253+385.81691806*[Calcoli.K7]+0.0107306*[Calcoli.K11]^2+0.00001236*[Calcoli.K11]^3;4)","v":559354.7543},null,"M1_LN",{"$f":"of:=ROUND(306.0253+385.81691806*[Calcoli.N7]+0.0107306*[Calcoli.N11]^2+0.00001236*[Calcoli.N11]^3;4)","v":559740.5713},null,"M1_LN",{"$f":"of:=ROUND(306.0253+385.81691806*[Calcoli.Q7]+0.0107306*[Calcoli.Q11]^2+0.00001236*[Calcoli.Q11]^3;4)","v":560126.3882},null,"M1_LN",{"$f":"of:=ROUND(306.0253+385.81691806*[Calcoli.T7]+0.0107306*[Calcoli.T11]^2+0.00001236*[Calcoli.T11]^3;4)","v":560512.2051},null,"M1_LN",{"$f":"of:=ROUND(306.0253+385.81691806*[Calcoli.W7]+0.0107306*[Calcoli.W11]^2+0.00001236*[Calcoli.W11]^3;4)","v":560898.0221},null,"M1_LN",{"$f":"of:=ROUND(306.0253+385.81691806*[Calcoli.Z7]+0.0107306*[Calcoli.Z11]^2+0.00001236*[Calcoli.Z11]^3;4)","v":561283.839},null,"M1_LN",{"$f":"of:=ROUND(306.0253+385.81691806*[Calcoli.AC7]+0.0107306*[Calcoli.AC11]^2+0.00001236*[Calcoli.AC11]^3;4)","v":561669.6559},null,"M1_LN",{"$f":"of:=ROUND(306.0253+385.81691806*[Calcoli.AF7]+0.0107306*[Calcoli.AF11]^2+0.00001236*[Calcoli.AF11]^3;4)","v":562055.4729},null,"M1_LN",{"$f":"of:=ROUND(306.0253+385.81691806*[Calcoli.AI7]+0.0107306*[Calcoli.AI11]^2+0.00001236*[Calcoli.AI11]^3;4)","v":562441.2898},null,"M1_LN",{"$f":"of:=ROUND(306.0253+385.81691806*[Calcoli.AL7]+0.0107306*[Calcoli.AL11]^2+0.00001236*[Calcoli.AL11]^3;4)","v":562827.1068},null,"M1_LN",{"$f":"of:=ROUND(306.0253+385.81691806*[Calcoli.AO7]+0.0107306*[Calcoli.AO11]^2+0.00001236*[Calcoli.AO11]^3;4)","v":563598.7406}]
["M1_a",{"$f":"of:=ROUND(INT([Calcoli.B24])-INT((INT([Calcoli.B24])/360))*360+[Calcoli.B24]-INT([Calcoli.B24]);4)","v":197.3035},null,"M1_a",{"$f":"of:=ROUND(INT([Calcoli.E24])-INT((INT([Calcoli.E24])/360))*360+[Calcoli.E24]-INT([Calcoli.E24]);4)","v":223.1204},null,"M1_a",{"$f":"of:=ROUND(INT([Calcoli.H24])-INT((INT([Calcoli.H24])/360))*360+[Calcoli.H24]-INT([Calcoli.H24]);4)","v":248.9374},null,"M1_a",{"$f":"of:=ROUND(INT([Calcoli.K24])-INT((INT([Calcoli.K24])/360))*360+[Calcoli.K24]-INT([Calcoli.K24]);4)","v":274.7543},null,"M1_a",{"$f":"of:=ROUND(INT([Calcoli.N24])-INT((INT([Calcoli.N24])/360))*360+[Calcoli.N24]-INT([Calcoli.N24]);4)","v":300.5713},null,"M1_a",{"$f":"of:=ROUND(INT([Calcoli.Q24])-INT((INT([Calcoli.Q24])/360))*360+[Calcoli.Q24]-INT([Calcoli.Q24]);4)","v":326.3882},null,"M1_a",{"$f":"of:=ROUND(INT([Calcoli.T24])-INT((INT([Calcoli.T24])/360))*360+[Calcoli.T24]-INT([Calcoli.T24]);4)","v":352.2051},null,"M1_a",{"$f":"of:=ROUND(INT([Calcoli.W24])-INT((INT([Calcoli.W24])/360))*360+[Calcoli.W24]-INT([Calcoli.W24]);4)","v":18.0221},null,"M1_a",{"$f":"of:=ROUND(INT([Calcoli.Z24])-INT((INT([Calcoli.Z24])/360))*360+[Calcoli.Z24]-INT([Calcoli.Z24]);4)","v":43.839},null,"M1_a",{"$f":"of:=ROUND(INT([Calcoli.AC24])-INT((INT([Calcoli.AC24])/360))*360+[Calcoli.AC24]-INT([Calcoli.AC24]);4)","v":69.6559},null,"M1_a",{"$f":"of:=ROUND(INT([Calcoli.AF24])-INT((INT([Calcoli.AF24])/360))*360+[Calcoli.AF24]-INT([Calcoli.AF24]);4)","v":95.4729},null,"M1_a",{"$f":"of:=ROUND(INT([Calcoli.AI24])-INT((INT([Calcoli.AI24])/360))*360+[Calcoli.AI24]-INT([Calcoli.AI24]);4)","v":121.2898},null,"M1_a",{"$f":"of:=ROUND(INT([Calcoli.AL24])-INT((INT([Calcoli.AL24])/360))*360+[Calcoli.AL24]-INT([Calcoli.AL24]);4)","v":147.1068},null,"M1_a",{"$f":"of:=ROUND(INT([Calcoli.AO24])-INT((INT([Calcoli.AO24])/360))*360+[Calcoli.AO24]-INT([Calcoli.AO24]);4)","v":198.7406}]
["M1_PQ",{"$f":"of:=ROUND(306.0253+385.81691806*[Calcoli.B8]+0.0107306*[Calcoli.B12]^2+0.00001236*[Calcoli.B12]^3;4)","v":558293.7577},null,"M1_PQ",{"$f":"of:=ROUND(306.0253+385.81691806*[Calcoli.E8]+0.0107306*[Calcoli.E12]^2+0.00001236*[Calcoli.E12]^3;4)","v":558679.5747},null,"M1_PQ",{"$f":"of:=ROUND(306.0253+385.81691806*[Calcoli.H8]+0.0107306*[Calcoli.H12]^2+0.00001236*[Calcoli.H12]^3;4)","v":559065.3916},null,"M1_PQ",{"$f":"of:=ROUND(306.0253+385.81691806*[Calcoli.K8]+0.0107306*[Calcoli.K12]^2+0.00001236*[Calcoli.K12]^3;4)","v":559451.2086},null,"M1_PQ",{"$f":"of:=ROUND(306.0253+385.81691806*[Calcoli.N8]+0.0107306*[Calcoli.N12]^2+0.00001236*[Calcoli.N12]^3;4)","v":559837.0255},null,"M1_PQ",{"$f":"of:=ROUND(306.0253+385.81691806*[Calcoli.Q8]+0.0107306*[Calcoli.Q12]^2+0.00001236*[Calcoli.Q12]^3;4)","v":560222.8424},null,"M1_PQ",{"$f":"of:=ROUND(306.0253+385.81691806*[Calcoli.T8]+0.0107306*[Calcoli.T12]^2+0.00001236*[Calcoli.T12]^3;4)","v":560608.6594},null,"M1_PQ",{"$f":"of:=ROUND(306.0253+385.81691806*[Calcoli.W8]+0.0107306*[Calcoli.W12]^2+0.00001236*[Calcoli.W12]^3;4)","v":560994.4763},null,"M1_PQ",{"$f":"of:=ROUND(306.0253+385.81691806*[Calcoli.Z8]+0.0107306*[Calcoli.Z12]^2+0.00001236*[Calcoli.Z12]^3;4)","v":561380.2932},null,"M1_PQ",{"$f":"of:=ROUND(306.0253+385.81691806*[Calcoli.AC8]+0.0107306*[Calcoli.AC12]^2+0.00001236*[Calcoli.AC12]^3;4)","v":561766.1102},null,"M1_PQ",{"$f":"of:=ROUND(306.0253+385.81691806*[Calcoli.AF8]+0.0107306*[Calcoli.AF12]^2+0.00001236*[Calcoli.AF12]^3;4)","v":562151.9271},null,"M1_PQ",{"$f":"of:=ROUND(306.0253+385.81691806*[Calcoli.AI8]+0.0107306*[Calcoli.AI12]^2+0.00001236*[Calcoli.AI12]^3;4)","v":562537.7441},null,"M1_PQ",{"$f":"of:=ROUND(306.0253+385.81691806*[Calcoli.AL8]+0.0107306*[Calcoli.AL12]^2+0.00001236*[Calcoli.AL12]^3;4)","v":562923.561},null,"M1_PQ",{"$f":"of:=ROUND(306.0253+385.81691806*[Calcoli.AO8]+0.0107306*[Calcoli.AO12]^2+0.00001236*[Calcoli.AO12]^3;4)","v":563695.1949}]
["M1_LP",{"$f":"of:=ROUND(306.0253+385.81691806*[Calcoli.B9]+0.0107306*[Calcoli.B13]^2+0.00001236*[Calcoli.B13]^3;4)","v":558390.212},null,"M1_LP",{"$f":"of:=ROUND(306.0253+385.81691806*[Calcoli.E9]+0.0107306*[Calcoli.E13]^2+0.00001236*[Calcoli.E13]^3;4)","v":558776.0289},null,"M1_LP",{"$f":"of:=ROUND(306.0253+385.81691806*[Calcoli.H9]+0.0107306*[Calcoli.H13]^2+0.00001236*[Calcoli.H13]^3;4)","v":559161.8458},null,"M1_LP",{"$f":"of:=ROUND(306.0253+385.81691806*[Calcoli.K9]+0.0107306*[Calcoli.K13]^2+0.00001236*[Calcoli.K13]^3;4)","v":559547.6628},null,"M1_LP",{"$f":"of:=ROUND(306.0253+385.81691806*[Calcoli.N9]+0.0107306*[Calcoli.N13]^2+0.00001236*[Calcoli.N13]^3;4)","v":559933.4797},null,"M1_LP",{"$f":"of:=ROUND(306.0253+385.81691806*[Calcoli.Q9]+0.0107306*[Calcoli.Q13]^2+0.00001236*[Calcoli.Q13]^3;4)","v":560319.2967},null,"M1_LP",{"$f":"of:=ROUND(306.0253+385.81691806*[Calcoli.T9]+0.0107306*[Calcoli.T13]^2+0.00001236*[Calcoli.T13]^3;4)","v":560705.1136},null,"M1_LP",{"$f":"of:=ROUND(306.0253+385.81691806*[Calcoli.W9]+0.0107306*[Calcoli.W13]^2+0.00001236*[Calcoli.W13]^3;4)","v":561090.9305},null,"M1_LP",{"$f":"of:=ROUND(306.0253+385.81691806*[Calcoli.Z9]+0.0107306*[Calcoli.Z13]^2+0.00001236*[Calcoli.Z13]^3;4)","v":561476.7475},null,"M1_LP",{"$f":"of:=ROUND(306.0253+385.81691806*[Calcoli.AC9]+0.0107306*[Calcoli.AC13]^2+0.00001236*[Calcoli.AC13]^3;4)","v":561862.5644},null,"M1_LP",{"$f":"of:=ROUND(306.0253+385.81691806*[Calcoli.AF9]+0.0107306*[Calcoli.AF13]^2+0.00001236*[Calcoli.AF13]^3;4)","v":562248.3814},null,"M1_LP",{"$f":"of:=ROUND(306.0253+385.81691806*[Calcoli.AI9]+0.0107306*[Calcoli.AI13]^2+0.00001236*[Calcoli.AI13]^3;4)","v":562634.1983},null,"M1_LP",{"$f":"of:=ROUND(306.0253+385.81691806*[Calcoli.AL9]+0.0107306*[Calcoli.AL13]^2+0.00001236*[Calcoli.AL13]^3;4)","v":563020.0152},null,"M1_LP",{"$f":"of:=ROUND(306.0253+385.81691806*[Calcoli.AO9]+0.0107306*[Calcoli.AO13]^2+0.00001236*[Calcoli.AO13]^3;4)","v":563791.6491}]
["M1_UQ",{"$f":"of:=ROUND(306.0253+385.81691806*[Calcoli.B10]+0.0107306*[Calcoli.B14]^2+0.00001236*[Calcoli.B14]^3;4)","v":558486.6662},null,"M1_UQ",{"$f":"of:=ROUND(306.0253+385.81691806*[Calcoli.E10]+0.0107306*[Calcoli.E14]^2+0.00001236*[Calcoli.E14]^3;4)","v":558872.4831},null,"M1_UQ",{"$f":"of:=ROUND(306.0253+385.81691806*[Calcoli.H10]+0.0107306*[Calcoli.H14]^2+0.00001236*[Calcoli.H14]^3;4)","v":559258.3001},null,"M1_UQ",{"$f":"of:=ROUND(306.0253+385.81691806*[Calcoli.K10]+0.0107306*[Calcoli.K14]^2+0.00001236*[Calcoli.K14]^3;4)","v":559644.117},null,"M1_UQ",{"$f":"of:=ROUND(306.0253+385.81691806*[Calcoli.N10]+0.0107306*[Calcoli.N14]^2+0.00001236*[Calcoli.N14]^3;4)","v":560029.934},null,"M1_UQ",{"$f":"of:=ROUND(306.0253+385.81691806*[Calcoli.Q10]+0.0107306*[Calcoli.Q14]^2+0.00001236*[Calcoli.Q14]^3;4)","v":560415.7509},null,"M1_UQ",{"$f":"of:=ROUND(306.0253+385.81691806*[Calcoli.T10]+0.0107306*[Calcoli.T14]^2+0.00001236*[Calcoli.T14]^3;4)","v":560801.5678},null,"M1_UQ",{"$f":"of:=ROUND(306.0253+385.81691806*[Calcoli.W10]+0.0107306*[Calcoli.W14]^2+0.00001236*[Calcoli.W14]^3;4)","v":561187.3848},null,"M1_UQ",{"$f":"of:=ROUND(306.0253+385.81691806*[Calcoli.Z10]+0.0107306*[Calcoli.Z14]^2+0.00001236*[Calcoli.Z14]^3;4)","v":561573.2017},null,"M1_UQ",{"$f":"of:=ROUND(306.0253+385.81691806*[Calcoli.AC10]+0.0107306*[Calcoli.AC14]^2+0.00001236*[Calcoli.AC14]^3;4)","v":561959.0187},null,"M1_UQ",{"$f":"of:=ROUND(306.0253+385.81691806*[Calcoli.AF10]+0.0107306*[Calcoli.AF14]^2+0.00001236*[Calcoli.AF14]^3;4)","v":562344.8356},null,"M1_UQ",{"$f":"of:=ROUND(306.0253+385.81691806*[Calcoli.AI10]+0.0107306*[Calcoli.AI14]^2+0.00001236*[Calcoli.AI14]^3;4)","v":562730.6525},null,"M1_UQ",{"$f":"of:=ROUND(306.0253+385.81691806*[Calcoli.AL10]+0.0107306*[Calcoli.AL14]^2+0.00001236*[Calcoli.AL14]^3;4)","v":563116.4695},null,"M1_UQ",{"$f":"of:=ROUND(306.0253+385.81691806*[Calcoli.AO10]+0.0107306*[Calcoli.AO14]^2+0.00001236*[Calcoli.AO14]^3;4)","v":563888.1033}]
["F_LN",{"$f":"of:=ROUND(21.2964+390.67050646*[Calcoli.B7]-0.0016528*[Calcoli.B11]^2-0.00000239*[Calcoli.B11]^3;4)","v":564930.8465},null,"F_LN",{"$f":"of:=ROUND(21.2964+390.67050646*[Calcoli.E7]-0.0016528*[Calcoli.E11]^2-0.00000239*[Calcoli.E11]^3;4)","v":565321.517},null,"F_LN",{"$f":"of:=ROUND(21.2964+390.67050646*[Calcoli.H7]-0.0016528*[Calcoli.H11]^2-0.00000239*[Calcoli.H11]^3;4)","v":565712.1875},null,"F_LN",{"$f":"of:=ROUND(21.2964+390.67050646*[Calcoli.K7]-0.0016528*[Calcoli.K11]^2-0.00000239*[Calcoli.K11]^3;4)","v":566102.858},null,"F_LN",{"$f":"of:=ROUND(21.2964+390.67050646*[Calcoli.N7]-0.0016528*[Calcoli.N11]^2-0.00000239*[Calcoli.N11]^3;4)","v":566493.5285},null,"F_LN",{"$f":"of:=ROUND(21.2964+390.67050646*[Calcoli.Q7]-0.0016528*[Calcoli.Q11]^2-0.00000239*[Calcoli.Q11]^3;4)","v":566884.199},null,"F_LN",{"$f":"of:=ROUND(21.2964+390.67050646*[Calcoli.T7]-0.0016528*[Calcoli.T11]^2-0.00000239*[Calcoli.T11]^3;4)","v":567274.8695},null,"F_LN",{"$f":"of:=ROUND(21.2964+390.67050646*[Calcoli.W7]-0.0016528*[Calcoli.W11]^2-0.00000239*[Calcoli.W11]^3;4)","v":567665.54},null,"F_LN",{"$f":"of:=ROUND(21.2964+390.67050646*[Calcoli.Z7]-0.0016528*[Calcoli.Z11]^2-0.00000239*[Calcoli.Z11]^3;4)","v":568056.2105},null,"F_LN",{"$f":"of:=ROUND(21.2964+390.67050646*[Calcoli.AC7]-0.0016528*[Calcoli.AC11]^2-0.00000239*[Calcoli.AC11]^3;4)","v":568446.881},null,"F_LN",{"$f":"of:=ROUND(21.2964+390.67050646*[Calcoli.AF7]-0.0016528*[Calcoli.AF11]^2-0.00000239*[Calcoli.AF11]^3;4)","v":568837.5515},null,"F_LN",{"$f":"of:=ROUND(21.2964+390.67050646*[Calcoli.AI7]-0.0016528*[Calcoli.AI11]^2-0.00000239*[Calcoli.AI11]^3;4)","v":569228.222},null,"F_LN",{"$f":"of:=ROUND(21.2964+390.67050646*[Calcoli.AL7]-0.0016528*[Calcoli.AL11]^2-0.00000239*[Calcoli.AL11]^3;4)","v":569618.8925},null,"F_LN",{"$f":"of:=ROUND(21.2964+390.67050646*[Calcoli.AO7]-0.0016528*[Calcoli.AO11]^2-0.00000239*[Calcoli.AO11]^3;4)","v":570400.2335}]
["F_a",{"$f":"of:=ROUND(INT([Calcoli.B29])-(INT(INT([Calcoli.B29])/360))*360+[Calcoli.B29]-INT([Calcoli.B29]);4)","v":90.8465},null,"F_a",{"$f":"of:=ROUND(INT([Calcoli.E29])-(INT(INT([Calcoli.E29])/360))*360+[Calcoli.E29]-INT([Calcoli.E29]);4)","v":121.517},null,"F_a",{"$f":"of:=ROUND(INT([Calcoli.H29])-(INT(INT([Calcoli.H29])/360))*360+[Calcoli.H29]-INT([Calcoli.H29]);4)","v":152.1875},null,"F_a",{"$f":"of:=ROUND(INT([Calcoli.K29])-(INT(INT([Calcoli.K29])/360))*360+[Calcoli.K29]-INT([Calcoli.K29]);4)","v":182.858},null,"F_a",{"$f":"of:=ROUND(INT([Calcoli.N29])-(INT(INT([Calcoli.N29])/360))*360+[Calcoli.N29]-INT([Calcoli.N29]);4)","v":213.5285},null,"F_a",{"$f":"of:=ROUND(INT([Calcoli.Q29])-(INT(INT([Calcoli.Q29])/360))*360+[Calcoli.Q29]-INT([Calcoli.Q29]);4)","v":244.199},null,"F_a",{"$f":"of:=ROUND(INT([Calcoli.T29])-(INT(INT([Calcoli.T29])/360))*360+[Calcoli.T29]-INT([Calcoli.T29]);4)","v":274.8695},null,"F_a",{"$f":"of:=ROUND(INT([Calcoli.W29])-(INT(INT([Calcoli.W29])/360))*360+[Calcoli.W29]-INT([Calcoli.W29]);4)","v":305.54},null,"F_a",{"$f":"of:=ROUND(INT([Calcoli.Z29])-(INT(INT([Calcoli.Z29])/360))*360+[Calcoli.Z29]-INT([Calcoli.Z29]);4)","v":336.2105},null,"F_a",{"$f":"of:=ROUND(INT([Calcoli.AC29])-(INT(INT([Calcoli.AC29])/360))*360+[Calcoli.AC29]-INT([Calcoli.AC29]);4)","v":6.881},null,"F_a",{"$f":"of:=ROUND(INT([Calcoli.AF29])-(INT(INT([Calcoli.AF29])/360))*360+[Calcoli.AF29]-INT([Calcoli.AF29]);4)","v":37.5515},null,"F_a",{"$f":"of:=ROUND(INT([Calcoli.AI29])-(INT(INT([Calcoli.AI29])/360))*360+[Calcoli.AI29]-INT([Calcoli.AI29]);4)","v":68.222},null,"F_a",{"$f":"of:=ROUND(INT([Calcoli.AL29])-(INT(INT([Calcoli.AL29])/360))*360+[Calcoli.AL29]-INT([Calcoli.AL29]);4)","v":98.8925},null,"F_a",{"$f":"of:=ROUND(INT([Calcoli.AO29])-(INT(INT([Calcoli.AO29])/360))*360+[Calcoli.AO29]-INT([Calcoli.AO29]);4)","v":160.2335}]
["F_PQ",{"$f":"of:=ROUND(21.2964+390.67050646*[Calcoli.B8]-0.0016528*[Calcoli.B12]^2-0.00000239*[Calcoli.B12]^3;4)","v":565028.5141},null,"F_PQ",{"$f":"of:=ROUND(21.2964+390.67050646*[Calcoli.E8]-0.0016528*[Calcoli.E12]^2-0.00000239*[Calcoli.E12]^3;4)","v":565419.1846},null,"F_PQ",{"$f":"of:=ROUND(21.2964+390.67050646*[Calcoli.H8]-0.0016528*[Calcoli.H12]^2-0.00000239*[Calcoli.H12]^3;4)","v":565809.8551},null,"F_PQ",{"$f":"of:=ROUND(21.2964+390.67050646*[Calcoli.K8]-0.0016528*[Calcoli.K12]^2-0.00000239*[Calcoli.K12]^3;4)","v":566200.5256},null,"F_PQ",{"$f":"of:=ROUND(21.2964+390.67050646*[Calcoli.N8]-0.0016528*[Calcoli.N12]^2-0.00000239*[Calcoli.N12]^3;4)","v":566591.1961},null,"F_PQ",{"$f":"of:=ROUND(21.2964+390.67050646*[Calcoli.Q8]-0.0016528*[Calcoli.Q12]^2-0.00000239*[Calcoli.Q12]^3;4)","v":566981.8666},null,"F_PQ",{"$f":"of:=ROUND(21.2964+390.67050646*[Calcoli.T8]-0.0016528*[Calcoli.T12]^2-0.00000239*[Calcoli.T12]^3;4)","v":567372.5371},null,"F_PQ",{"$f":"of:=ROUND(21.2964+390.67050646*[Calcoli.W8]-0.0016528*[Calcoli.W12]^2-0.00000239*[Calcoli.W12]^3;4)","v":567763.2076},null,"F_PQ",{"$f":"of:=ROUND(21.2964+390.67050646*[Calcoli.Z8]-0.0016528*[Calcoli.Z12]^2-0.00000239*[Calcoli.Z12]^3;4)","v":568153.8781},null,"F_PQ",{"$f":"of:=ROUND(21.2964+390.67050646*[Calcoli.AC8]-0.0016528*[Calcoli.AC12]^2-0.00000239*[Calcoli.AC12]^3;4)","v":568544.5486},null,"F_PQ",{"$f":"of:=ROUND(21.2964+390.67050646*[Calcoli.AF8]-0.0016528*[Calcoli.AF12]^2-0.00000239*[Calcoli.AF12]^3;4)","v":568935.2191},null,"F_PQ",{"$f":"of:=ROUND(21.2964+390.67050646*[Calcoli.AI8]-0.0016528*[Calcoli.AI12]^2-0.00000239*[Calcoli.AI12]^3;4)","v":569325.8896},null,"F_PQ",{"$f":"of:=ROUND(21.2964+390.67050646*[Calcoli.AL8]-0.0016528*[Calcoli.AL12]^2-0.00000239*[Calcoli.AL12]^3;4)","v":569716.5601},null,"F_PQ",{"$f":"of:=ROUND(21.2964+390.67050646*[Calcoli.AO8]-0.0016528*[Calcoli.AO12]^2-0.00000239*[Calcoli.AO12]^3;4)","v":570497.9012}]
["F_LP",{"$f":"of:=ROUND(21.2964+390.67050646*[Calcoli.B9]-0.0016528*[Calcoli.B13]^2-0.00000239*[Calcoli.B13]^3;4)","v":565126.1817},null,"F_LP",{"$f":"of:=ROUND(21.2964+390.67050646*[Calcoli.E9]-0.0016528*[Calcoli.E13]^2-0.00000239*[Calcoli.E13]^3;4)","v":565516.8522},null,"F_LP",{"$f":"of:=ROUND(21.2964+390.67050646*[Calcoli.H9]-0.0016528*[Calcoli.H13]^2-0.00000239*[Calcoli.H13]^3;4)","v":565907.5227},null,"F_LP",{"$f":"of:=ROUND(21.2964+390.67050646*[Calcoli.K9]-0.0016528*[Calcoli.K13]^2-0.00000239*[Calcoli.K13]^3;4)","v":566298.1932},null,"F_LP",{"$f":"of:=ROUND(21.2964+390.67050646*[Calcoli.N9]-0.0016528*[Calcoli.N13]^2-0.00000239*[Calcoli.N13]^3;4)","v":566688.8637},null,"F_LP",{"$f":"of:=ROUND(21.2964+390.67050646*[Calcoli.Q9]-0.0016528*[Calcoli.Q13]^2-0.00000239*[Calcoli.Q13]^3;4)","v":567079.5342},null,"F_LP",{"$f":"of:=ROUND(21.2964+390.67050646*[Calcoli.T9]-0.0016528*[Calcoli.T13]^2-0.00000239*[Calcoli.T13]^3;4)","v":567470.2047},null,"F_LP",{"$f":"of:=ROUND(21.2964+390.67050646*[Calcoli.W9]-0.0016528*[Calcoli.W13]^2-0.00000239*[Calcoli.W13]^3;4)","v":567860.8753},null,"F_LP",{"$f":"of:=ROUND(21.2964+390.67050646*[Calcoli.Z9]-0.0016528*[Calcoli.Z13]^2-0.00000239*[Calcoli.Z13]^3;4)","v":568251.5458},null,"F_LP",{"$f":"of:=ROUND(21.2964+390.67050646*[Calcoli.AC9]-0.0016528*[Calcoli.AC13]^2-0.00000239*[Calcoli.AC13]^3;4)","v":568642.2163},null,"F_LP",{"$f":"of:=ROUND(21.2964+390.67050646*[Calcoli.AF9]-0.0016528*[Calcoli.AF13]^2-0.00000239*[Calcoli.AF13]^3;4)","v":569032.8868},null,"F_LP",{"$f":"of:=ROUND(21.2964+390.67050646*[Calcoli.AI9]-0.0016528*[Calcoli.AI13]^2-0.00000239*[Calcoli.AI13]^3;4)","v":569423.5573},null,"F_LP",{"$f":"of:=ROUND(21.2964+390.67050646*[Calcoli.AL9]-0.0016528*[Calcoli.AL13]^2-0.00000239*[Calcoli.AL13]^3;4)","v":569814.2278},null,"F_LP",{"$f":"of:=ROUND(21.2964+390.67050646*[Calcoli.AO9]-0.0016528*[Calcoli.AO13]^2-0.00000239*[Calcoli.AO13]^3;4)","v":570595.5688}]
["F_UQ",{"$f":"of:=ROUND(21.2964+390.67050646*[Calcoli.B10]-0.0016528*[Calcoli.B14]^2-0.00000239*[Calcoli.B14]^3;4)","v":565223.8494},null,"F_UQ",{"$f":"of:=ROUND(21.2964+390.67050646*[Calcoli.E10]-0.0016528*[Calcoli.E14]^2-0.00000239*[Calcoli.E14]^3;4)","v":565614.5199},null,"F_UQ",{"$f":"of:=ROUND(21.2964+390.67050646*[Calcoli.H10]-0.0016528*[Calcoli.H14]^2-0.00000239*[Calcoli.H14]^3;4)","v":566005.1904},null,"F_UQ",{"$f":"of:=ROUND(21.2964+390.67050646*[Calcoli.K10]-0.0016528*[Calcoli.K14]^2-0.00000239*[Calcoli.K14]^3;4)","v":566395.8609},null,"F_UQ",{"$f":"of:=ROUND(21.2964+390.67050646*[Calcoli.N10]-0.0016528*[Calcoli.N14]^2-0.00000239*[Calcoli.N14]^3;4)","v":566786.5314},null,"F_UQ",{"$f":"of:=ROUND(21.2964+390.67050646*[Calcoli.Q10]-0.0016528*[Calcoli.Q14]^2-0.00000239*[Calcoli.Q14]^3;4)","v":567177.2019},null,"F_UQ",{"$f":"of:=ROUND(21.2964+390.67050646*[Calcoli.T10]-0.0016528*[Calcoli.T14]^2-0.00000239*[Calcoli.T14]^3;4)","v":567567.8724},null,"F_UQ",{"$f":"of:=ROUND(21.2964+390.67050646*[Calcoli.W10]-0.0016528*[Calcoli.W14]^2-0.00000239*[Calcoli.W14]^3;4)","v":567958.5429},null,"F_UQ",{"$f":"of:=ROUND(21.2964+390.67050646*[Calcoli.Z10]-0.0016528*[Calcoli.Z14]^2-0.00000239*[Calcoli.Z14]^3;4)","v":568349.2134},null,"F_UQ",{"$f":"of:=ROUND(21.2964+390.67050646*[Calcoli.AC10]-0.0016528*[Calcoli.AC14]^2-0.00000239*[Calcoli.AC14]^3;4)","v":568739.8839},null,"F_UQ",{"$f":"of:=ROUND(21.2964+390.67050646*[Calcoli.AF10]-0.0016528*[Calcoli.AF14]^2-0.00000239*[Calcoli.AF14]^3;4)","v":569130.5544},null,"F_UQ",{"$f":"of:=ROUND(21.2964+390.67050646*[Calcoli.AI10]-0.0016528*[Calcoli.AI14]^2-0.00000239*[Calcoli.AI14]^3;4)","v":569521.2249},null,"F_UQ",{"$f":"of:=ROUND(21.2964+390.67050646*[Calcoli.AL10]-0.0016528*[Calcoli.AL14]^2-0.00000239*[Calcoli.AL14]^3;4)","v":569911.8954},null,"F_UQ",{"$f":"of:=ROUND(21.2964+390.67050646*[Calcoli.AO10]-0.0016528*[Calcoli.AO14]^2-0.00000239*[Calcoli.AO14]^3;4)","v":570693.2364}]
["Corr_LN",{"$f":"of:=ROUND((0.1734-0.000393*[Calcoli.B11])*SIN(RADIANS([Calcoli.B19]))+0.0021*SIN(RADIANS(2*[Calcoli.B19]))-0.4068*SIN(RADIANS([Calcoli.B24]))+0.0161*SIN(RADIANS(2*[Calcoli.B24]))-0.0004*SIN(RADIANS(3*[Calcoli.B24]))+0.0104*SIN(RADIANS(2*[Calcoli.B29]))-0.0051*SIN(RADIANS([Calcoli.B19]+[Calcoli.B24]))-0.0074*SIN(RADIANS([Calcoli.B19]-[Calcoli.B24]))+0.0004*SIN(RADIANS(2*[Calcoli.B29]+[Calcoli.B19]))-0.0004*SIN(RADIANS(2*[Calcoli.B29]-[Calcoli.B19]))-0.0006*SIN(RADIANS(2*[Calcoli.B29]+[Calcoli.B24]))+0.001*SIN(RADIANS(2*[Calcoli.B29]-[Calcoli.B24]))+0.0005*SIN(RADIANS([Calcoli.B19]+2*[Calcoli.B24]));4)","v":0.0231},null,"Corr_LN",{"$f":"of:=ROUND((0.1734-0.000393*[Calcoli.E11])*SIN(RADIANS([Calcoli.E19]))+0.0021*SIN(RADIANS(2*[Calcoli.E19]))-0.4068*SIN(RADIANS([Calcoli.E24]))+0.0161*SIN(RADIANS(2*[Calcoli.E24]))-0.0004*SIN(RADIANS(3*[Calcoli.E24]))+0.0104*SIN(RADIANS(2*[Calcoli.E29]))-0.0051*SIN(RADIANS([Calcoli.E19]+[Calcoli.E24]))-0.0074*SIN(RADIANS([Calcoli.E19]-[Calcoli.E24]))+0.0004*SIN(RADIANS(2*[Calcoli.E29]+[Calcoli.E19]))-0.0004*SIN(RADIANS(2*[Calcoli.E29]-[Calcoli.E19]))-0.0006*SIN(RADIANS(2*[Calcoli.E29]+[Calcoli.E24]))+0.001*SIN(RADIANS(2*[Calcoli.E29]-[Calcoli.E24]))+0.0005*SIN(RADIANS([Calcoli.E19]+2*[Calcoli.E24]));4)","v":0.2666},null,"Corr_LN",{"$f":"of:=ROUND((0.1734-0.000393*[Calcoli.H11])*SIN(RADIANS([Calcoli.H19]))+0.0021*SIN(RADIANS(2*[Calcoli.H19]))-0.4068*SIN(RADIANS([Calcoli.H24]))+0.0161*SIN(RADIANS(2*[Calcoli.H24]))-0.0004*SIN(RADIANS(3*[Calcoli.H24]))+0.0104*SIN(RADIANS(2*[Calcoli.H29]))-0.0051*SIN(RADIANS([Calcoli.H19]+[Calcoli.H24]))-0.0074*SIN(RADIANS([Calcoli.H19]-[Calcoli.H24]))+0.0004*SIN(RADIANS(2*[Calcoli.H29]+[Calcoli.H19]))-0.0004*SIN(RADIANS(2*[Calcoli.H29]-[Calcoli.H19]))-0.0006*SIN(RADIANS(2*[Calcoli.H29]+[Calcoli.H24]))+0.001*SIN(RADIANS(2*[Calcoli.H29]-[Calcoli.H24]))+0.0005*SIN(RADIANS([Calcoli.H19]+2*[Calcoli.H24]));4)","v":0.4541},null,"Corr_LN",{"$f":"of:=ROUND((0.1734-0.000393*[Calcoli.K11])*SIN(RADIANS([Calcoli.K19]))+0.0021*SIN(RADIANS(2*[Calcoli.K19]))-0.4068*SIN(RADIANS([Calcoli.K24]))+0.0161*SIN(RADIANS(2*[Calcoli.K24]))-0.0004*SIN(RADIANS(3*[Calcoli.K24]))+0.0104*SIN(RADIANS(2*[Calcoli.K29]))-0.0051*SIN(RADIANS([Calcoli.K19]+[Calcoli.K24]))-0.0074*SIN(RADIANS([Calcoli.K19]-[Calcoli.K24]))+0.0004*SIN(RADIANS(2*[Calcoli.K29]+[Calcoli.K19]))-0.0004*SIN(RADIANS(2*[Calcoli.K29]-[Calcoli.K19]))-0.0006*SIN(RADIANS(2*[Calcoli.K29]+[Calcoli.K24]))+0.001*SIN(RADIANS(2*[Calcoli.K29]-[Calcoli.K24]))+0.0005*SIN(RADIANS([Calcoli.K19]+2*[Calcoli.K24]));4)","v":0.5429},null,"Corr_LN",{"$f":"of:=ROUND((0.1734-0.000393*[Calcoli.N11])*SIN(RADIANS([Calcoli.N19]))+0.0021*SIN(RADIANS(2*[Calcoli.N19]))-0.4068*SIN(RADIANS([Calcoli.N24]))+0.0161*SIN(RADIANS(2*[Calcoli.N24]))-0.0004*SIN(RADIANS(3*[Calcoli.N24]))+0.0104*SIN(RADIANS(2*[Calcoli.N29]))-0.0051*SIN(RADIANS([Calcoli.N19]+[Calcoli.N24]))-0.0074*SIN(RADIANS([Calcoli.N19]-[Calcoli.N24]))+0.0004*SIN(RADIANS(2*[Calcoli.N29]+[Calcoli.N19]))-0.0004*SIN(RADIANS(2*[Calcoli.N29]-[Calcoli.N19]))-0.0006*SIN(RADIANS(2*[Calcoli.N29]+[Calcoli.N24]))+0.001*SIN(RADIANS(2*[Calcoli.N29]-[Calcoli.N24]))+0.0005*SIN(RADIANS([Calcoli.N19]+2*[Calcoli.N24]));4)","v":0.5117},null,"Corr_LN",{"$f":"of:=ROUND((0.1734-0.000393*[Calcoli.Q11])*SIN(RADIANS([Calcoli.Q19]))+0.0021*SIN(RADIANS(2*[Calcoli.Q19]))-0.4068*SIN(RADIANS([Calcoli.Q24]))+0.0161*SIN(RADIANS(2*[Calcoli.Q24]))-0.0004*SIN(RADIANS(3*[Calcoli.Q24]))+0.0104*SIN(RADIANS(2*[Calcoli.Q29]))-0.0051*SIN(RADIANS([Calcoli.Q19]+[Calcoli.Q24]))-0.0074*SIN(RADIANS([Calcoli.Q19]-[Calcoli.Q24]))+0.0004*SIN(RADIANS(2*[Calcoli.Q29]+[Calcoli.Q19]))-0.0004*SIN(RADIANS(2*[Calcoli.Q29]-[Calcoli.Q19]))-0.0006*SIN(RADIANS(2*[Calcoli.Q29]+[Calcoli.Q24]))+0.001*SIN(RADIANS(2*[Calcoli.Q29]-[Calcoli.Q24]))+0.0005*SIN(RADIANS([Calcoli.Q19]+2*[Calcoli.Q24]));4)","v":0.3692},null,"Corr_LN",{"$f":"of:=ROUND((0.1734-0.000393*[Calcoli.T11])*SIN(RADIANS([Calcoli.T19]))+0.0021*SIN(RADIANS(2*[Calcoli.T19]))-0.4068*SIN(RADIANS([Calcoli.T24]))+0.0161*SIN(RADIANS(2*[Calcoli.T24]))-0.0004*SIN(RADIANS(3*[Calcoli.T24]))+0.0104*SIN(RADIANS(2*[Calcoli.T29]))-0.0051*SIN(RADIANS([Calcoli.T19]+[Calcoli.T24]))-0.0074*SIN(RADIANS([Calcoli.T19]-[Calcoli.T24]))+0.0004*SIN(RADIANS(2*[Calcoli.T29]+[Calcoli.T19]))-0.0004*SIN(RADIANS(2*[Calcoli.T29]-[Calcoli.T19]))-0.0006*SIN(RADIANS(2*[Calcoli.T29]+[Calcoli.T24]))+0.001*SIN(RADIANS(2*[Calcoli.T29]-[Calcoli.T24]))+0.0005*SIN(RADIANS([Calcoli.T19]+2*[Calcoli.T24]));4)","v":0.1498},null,"Corr_LN",{"$f":"of:=ROUND((0.1734-0.000393*[Calcoli.W11])*SIN(RADIANS([Calcoli.W19]))+0.0021*SIN(RADIANS(2*[Calcoli.W19]))-0.4068*SIN(RADIANS([Calcoli.W24]))+0.0161*SIN(RADIANS(2*[Calcoli.W24]))-0.0004*SIN(RADIANS(3*[Calcoli.W24]))+0.0104*SIN(RADIANS(2*[Calcoli.W29]))-0.0051*SIN(RADIANS([Calcoli.W19]+[Calcoli.W24]))-0.0074*SIN(RADIANS([Calcoli.W19]-[Calcoli.W24]))+0.0004*SIN(RADIANS(2*[Calcoli.W29]+[Calcoli.W19]))-0.0004*SIN(RADIANS(2*[Calcoli.W29]-[Calcoli.W19]))-0.0006*SIN(RADIANS(2*[Calcoli.W29]+[Calcoli.W24]))+0.001*SIN(RADIANS(2*[Calcoli.W29]-[Calcoli.W24]))+0.0005*SIN(RADIANS([Calcoli.W19]+2*[Calcoli.W24]));4)","v":-0.0986},null,"Corr_LN",{"$f":"of:=ROUND((0.1734-0.000393*[Calcoli.Z11])*SIN(RADIANS([Calcoli.Z19]))+0.0021*SIN(RADIANS(2*[Calcoli.Z19]))-0.4068*SIN(RADIANS([Calcoli.Z24]))+0.0161*SIN(RADIANS(2*[Calcoli.Z24]))-0.0004*SIN(RADIANS(3*[Calcoli.Z24]))+0.0104*SIN(RADIANS(2*[Calcoli.Z29]))-0.0051*SIN(RADIANS([Calcoli.Z19]+[Calcoli.Z24]))-0.0074*SIN(RADIANS([Calcoli.Z19]-[Calcoli.Z24]))+0.0004*SIN(RADIANS(2*[Calcoli.Z29]+[Calcoli.Z19]))-0.0004*SIN(RADIANS(2*[Calcoli.Z29]-[Calcoli.Z19]))-0.0006*SIN(RADIANS(2*[Calcoli.Z29]+[Calcoli.Z24]))+0.001*SIN(RADIANS(2*[Calcoli.Z29]-[Calcoli.Z24]))+0.0005*SIN(RADIANS([Calcoli.Z19]+2*[Calcoli.Z24]));4)","v":-0.3273},null,"Corr_LN",{"$f":"of:=ROUND((0.1734-0.000393*[Calcoli.AC11])*SIN(RADIANS([Calcoli.AC19]))+0.0021*SIN(RADIANS(2*[Calcoli.AC19]))-0.4068*SIN(RADIANS([Calcoli.AC24]))+0.0161*SIN(RADIANS(2*[Calcoli.AC24]))-0.0004*SIN(RADIANS(3*[Calcoli.AC24]))+0.0104*SIN(RADIANS(2*[Calcoli.AC29]))-0.0051*SIN(RADIANS([Calcoli.AC19]+[Calcoli.AC24]))-0.0074*SIN(RADIANS([Calcoli.AC19]-[Calcoli.AC24]))+0.0004*SIN(RADIANS(2*[Calcoli.AC29]+[Calcoli.AC19]))-0.0004*SIN(RADIANS(2*[Calcoli.AC29]-[Calcoli.AC19]))-0.0006*SIN(RADIANS(2*[Calcoli.AC29]+[Calcoli.AC24]))+0.001*SIN(RADIANS(2*[Calcoli.AC29]-[Calcoli.AC24]))+0.0005*SIN(RADIANS([Calcoli.AC19]+2*[Calcoli.AC24]));4)","v":-0.4939},null,"Corr_LN",{"$f":"of:=ROUND((0.1734-0.000393*[Calcoli.AF11])*SIN(RADIANS([Calcoli.AF19]))+0.0021*SIN(RADIANS(2*[Calcoli.AF19]))-0.4068*SIN(RADIANS([Calcoli.AF24]))+0.0161*SIN(RADIANS(2*[Calcoli.AF24]))-0.0004*SIN(RADIANS(3*[Calcoli.AF24]))+0.0104*SIN(RADIANS(2*[Calcoli.AF29]))-0.0051*SIN(RADIANS([Calcoli.AF19]+[Calcoli.AF24]))-0.0074*SIN(RADIANS([Calcoli.AF19]-[Calcoli.AF24]))+0.0004*SIN(RADIANS(2*[Calcoli.AF29]+[Calcoli.AF19]))-0.0004*SIN(RADIANS(2*[Calcoli.AF29]-[Calcoli.AF19]))-0.0006*SIN(RADIANS(2*[Calcoli.AF29]+[Calcoli.AF24]))+0.001*SIN(RADIANS(2*[Calcoli.AF29]-[Calcoli.AF24]))+0.0005*SIN(RADIANS([Calcoli.AF19]+2*[Calcoli.AF24]));4)","v":-0.5667},null,"Corr_LN",{"$f":"of:=ROUND((0.1734-0.000393*[Calcoli.AI11])*SIN(RADIANS([Calcoli.AI19]))+0.0021*SIN(RADIANS(2*[Calcoli.AI19]))-0.4068*SIN(RADIANS([Calcoli.AI24]))+0.0161*SIN(RADIANS(2*[Calcoli.AI24]))-0.0004*SIN(RADIANS(3*[Calcoli.AI24]))+0.0104*SIN(RADIANS(2*[Calcoli.AI29]))-0.0051*SIN(RADIANS([Calcoli.AI19]+[Calcoli.AI24]))-0.0074*SIN(RADIANS([Calcoli.AI19]-[Calcoli.AI24]))+0.0004*SIN(RADIANS(2*[Calcoli.AI29]+[Calcoli.AI19]))-0.0004*SIN(RADIANS(2*[Calcoli.AI29]-[Calcoli.AI19]))-0.0006*SIN(RADIANS(2*[Calcoli.AI29]+[Calcoli.AI24]))+0.001*SIN(RADIANS(2*[Calcoli.AI29]-[Calcoli.AI24]))+0.0005*SIN(RADIANS([Calcoli.AI19]+2*[Calcoli.AI24]));4)","v":-0.5266},null,"Corr_LN",{"$f":"of:=ROUND((0.1734-0.000393*[Calcoli.AL11])*SIN(RADIANS([Calcoli.AL19]))+0.0021*SIN(RADIANS(2*[Calcoli.AL19]))-0.4068*SIN(RADIANS([Calcoli.AL24]))+0.0161*SIN(RADIANS(2*[Calcoli.AL24]))-0.0004*SIN(RADIANS(3*[Calcoli.AL24]))+0.0104*SIN(RADIANS(2*[Calcoli.AL29]))-0.0051*SIN(RADIANS([Calcoli.AL19]+[Calcoli.AL24]))-0.0074*SIN(RADIANS([Calcoli.AL19]-[Calcoli.AL24]))+0.0004*SIN(RADIANS(2*[Calcoli.AL29]+[Calcoli.AL19]))-0.0004*SIN(RADIANS(2*[Calcoli.AL29]-[Calcoli.AL19]))-0.0006*SIN(RADIANS(2*[Calcoli.AL29]+[Calcoli.AL24]))+0.001*SIN(RADIANS(2*[Calcoli.AL29]-[Calcoli.AL24]))+0.0005*SIN(RADIANS([Calcoli.AL19]+2*[Calcoli.AL24]));4)","v":-0.3695},null,"Corr_LN",{"$f":"of:=ROUND((0.1734-0.000393*[Calcoli.AO11])*SIN(RADIANS([Calcoli.AO19]))+0.0021*SIN(RADIANS(2*[Calcoli.AO19]))-0.4068*SIN(RADIANS([Calcoli.AO24]))+0.0161*SIN(RADIANS(2*[Calcoli.AO24]))-0.0004*SIN(RADIANS(3*[Calcoli.AO24]))+0.0104*SIN(RADIANS(2*[Calcoli.AO29]))-0.0051*SIN(RADIANS([Calcoli.AO19]+[Calcoli.AO24]))-0.0074*SIN(RADIANS([Calcoli.AO19]-[Calcoli.AO24]))+0.0004*SIN(RADIANS(2*[Calcoli.AO29]+[Calcoli.AO19]))-0.0004*SIN(RADIANS(2*[Calcoli.AO29]-[Calcoli.AO19]))-0.0006*SIN(RADIANS(2*[Calcoli.AO29]+[Calcoli.AO24]))+0.001*SIN(RADIANS(2*[Calcoli.AO29]-[Calcoli.AO24]))+0.0005*SIN(RADIANS([Calcoli.AO19]+2*[Calcoli.AO24]));4)","v":0.1773}]
["Corr_PQ",{"$f":"of:=ROUND((0.1721-0.0004*[Calcoli.B12])*SIN(RADIANS([Calcoli.B21]))+0.0021*SIN(RADIANS(2*[Calcoli.B21]))-0.628*SIN(RADIANS([Calcoli.B26]))+0.0089*SIN(RADIANS(2*[Calcoli.B26]))-0.0004*SIN(RADIANS(3*[Calcoli.B26]))+0.0079*SIN(RADIANS(2*[Calcoli.B31]))-0.0119*SIN(RADIANS([Calcoli.B21]+[Calcoli.B26]))-0.0047*SIN(RADIANS([Calcoli.B21]-[Calcoli.B26]))+0.0003*SIN(RADIANS(2*[Calcoli.B31]+[Calcoli.B21]))-0.0004*SIN(RADIANS(2*[Calcoli.B31]-[Calcoli.B21]))-0.0006*SIN(RADIANS(2*[Calcoli.B31]+[Calcoli.B26]))+0.0021*SIN(RADIANS(2*[Calcoli.B31]-[Calcoli.B26]))+0.0003*SIN(RADIANS([Calcoli.B21]+2*[Calcoli.B26]))+0.0004*SIN(RADIANS([Calcoli.B21]-2*[Calcoli.B26]))-0.0003*SIN(RADIANS(2*[Calcoli.B21]+[Calcoli.B26]));4)","v":0.502},null,"Corr_PQ",{"$f":"of:=ROUND((0.1721-0.0004*[Calcoli.E12])*SIN(RADIANS([Calcoli.E21]))+0.0021*SIN(RADIANS(2*[Calcoli.E21]))-0.628*SIN(RADIANS([Calcoli.E26]))+0.0089*SIN(RADIANS(2*[Calcoli.E26]))-0.0004*SIN(RADIANS(3*[Calcoli.E26]))+0.0079*SIN(RADIANS(2*[Calcoli.E31]))-0.0119*SIN(RADIANS([Calcoli.E21]+[Calcoli.E26]))-0.0047*SIN(RADIANS([Calcoli.E21]-[Calcoli.E26]))+0.0003*SIN(RADIANS(2*[Calcoli.E31]+[Calcoli.E21]))-0.0004*SIN(RADIANS(2*[Calcoli.E31]-[Calcoli.E21]))-0.0006*SIN(RADIANS(2*[Calcoli.E31]+[Calcoli.E26]))+0.0021*SIN(RADIANS(2*[Calcoli.E31]-[Calcoli.E26]))+0.0003*SIN(RADIANS([Calcoli.E21]+2*[Calcoli.E26]))+0.0004*SIN(RADIANS([Calcoli.E21]-2*[Calcoli.E26]))-0.0003*SIN(RADIANS(2*[Calcoli.E21]+[Calcoli.E26]));4)","v":0.4184},null,"Corr_PQ",{"$f":"of:=ROUND((0.1721-0.0004*[Calcoli.H12])*SIN(RADIANS([Calcoli.H21]))+0.0021*SIN(RADIANS(2*[Calcoli.H21]))-0.628*SIN(RADIANS([Calcoli.H26]))+0.0089*SIN(RADIANS(2*[Calcoli.H26]))-0.0004*SIN(RADIANS(3*[Calcoli.H26]))+0.0079*SIN(RADIANS(2*[Calcoli.H31]))-0.0119*SIN(RADIANS([Calcoli.H21]+[Calcoli.H26]))-0.0047*SIN(RADIANS([Calcoli.H21]-[Calcoli.H26]))+0.0003*SIN(RADIANS(2*[Calcoli.H31]+[Calcoli.H21]))-0.0004*SIN(RADIANS(2*[Calcoli.H31]-[Calcoli.H21]))-0.0006*SIN(RADIANS(2*[Calcoli.H31]+[Calcoli.H26]))+0.0021*SIN(RADIANS(2*[Calcoli.H31]-[Calcoli.H26]))+0.0003*SIN(RADIANS([Calcoli.H21]+2*[Calcoli.H26]))+0.0004*SIN(RADIANS([Calcoli.H21]-2*[Calcoli.H26]))-0.0003*SIN(RADIANS(2*[Calcoli.H21]+[Calcoli.H26]));4)","v":0.2433},null,"Corr_PQ",{"$f":"of:=ROUND((0.1721-0.0004*[Calcoli.K12])*SIN(RADIANS([Calcoli.K21]))+0.0021*SIN(RADIANS(2*[Calcoli.K21]))-0.628*SIN(RADIANS([Calcoli.K26]))+0.0089*SIN(RADIANS(2*[Calcoli.K26]))-0.0004*SIN(RADIANS(3*[Calcoli.K26]))+0.0079*SIN(RADIANS(2*[Calcoli.K31]))-0.0119*SIN(RADIANS([Calcoli.K21]+[Calcoli.K26]))-0.0047*SIN(RADIANS([Calcoli.K21]-[Calcoli.K26]))+0.0003*SIN(RADIANS(2*[Calcoli.K31]+[Calcoli.K21]))-0.0004*SIN(RADIANS(2*[Calcoli.K31]-[Calcoli.K21]))-0.0006*SIN(RADIANS(2*[Calcoli.K31]+[Calcoli.K26]))+0.0021*SIN(RADIANS(2*[Calcoli.K31]-[Calcoli.K26]))+0.0003*SIN(RADIANS([Calcoli.K21]+2*[Calcoli.K26]))+0.0004*SIN(RADIANS([Calcoli.K21]-2*[Calcoli.K26]))-0.0003*SIN(RADIANS(2*[Calcoli.K21]+[Calcoli.K26]));4)","v":0.0139},null,"Corr_PQ",{"$f":"of:=ROUND((0.1721-0.0004*[Calcoli.N12])*SIN(RADIANS([Calcoli.N21]))+0.0021*SIN(RADIANS(2*[Calcoli.N21]))-0.628*SIN(RADIANS([Calcoli.N26]))+0.0089*SIN(RADIANS(2*[Calcoli.N26]))-0.0004*SIN(RADIANS(3*[Calcoli.N26]))+0.0079*SIN(RADIANS(2*[Calcoli.N31]))-0.0119*SIN(RADIANS([Calcoli.N21]+[Calcoli.N26]))-0.0047*SIN(RADIANS([Calcoli.N21]-[Calcoli.N26]))+0.0003*SIN(RADIANS(2*[Calcoli.N31]+[Calcoli.N21]))-0.0004*SIN(RADIANS(2*[Calcoli.N31]-[Calcoli.N21]))-0.0006*SIN(RADIANS(2*[Calcoli.N31]+[Calcoli.N26]))+0.0021*SIN(RADIANS(2*[Calcoli.N31]-[Calcoli.N26]))+0.0003*SIN(RADIANS([Calcoli.N21]+2*[Calcoli.N26]))+0.0004*SIN(RADIANS([Calcoli.N21]-2*[Calcoli.N26]))-0.0003*SIN(RADIANS(2*[Calcoli.N21]+[Calcoli.N26]));4)","v":-0.2201},null,"Corr_PQ",{"$f":"of:=ROUND((0.1721-0.0004*[Calcoli.Q12])*SIN(RADIANS([Calcoli.Q21]))+0.0021*SIN(RADIANS(2*[Calcoli.Q21]))-0.628*SIN(RADIANS([Calcoli.Q26]))+0.0089*SIN(RADIANS(2*[Calcoli.Q26]))-0.0004*SIN(RADIANS(3*[Calcoli.Q26]))+0.0079*SIN(RADIANS(2*[Calcoli.Q31]))-0.0119*SIN(RADIANS([Calcoli.Q21]+[Calcoli.Q26]))-0.0047*SIN(RADIANS([Calcoli.Q21]-[Calcoli.Q26]))+0.0003*SIN(RADIANS(2*[Calcoli.Q31]+[Calcoli.Q21]))-0.0004*SIN(RADIANS(2*[Calcoli.Q31]-[Calcoli.Q21]))-0.0006*SIN(RADIANS(2*[Calcoli.Q31]+[Calcoli.Q26]))+0.0021*SIN(RADIANS(2*[Calcoli.Q31]-[Calcoli.Q26]))+0.0003*SIN(RADIANS([Calcoli.Q21]+2*[Calcoli.Q26]))+0.0004*SIN(RADIANS([Calcoli.Q21]-2*[Calcoli.Q26]))-0.0003*SIN(RADIANS(2*[Calcoli.Q21]+[Calcoli.Q26]));4)","v":-0.4124},null,"Corr_PQ",{"$f":"of:=ROUND((0.1721-0.0004*[Calcoli.T12])*SIN(RADIANS([Calcoli.T21]))+0.0021*SIN(RADIANS(2*[Calcoli.T21]))-0.628*SIN(RADIANS([Calcoli.T26]))+0.0089*SIN(RADIANS(2*[Calcoli.T26]))-0.0004*SIN(RADIANS(3*[Calcoli.T26]))+0.0079*SIN(RADIANS(2*[Calcoli.T31]))-0.0119*SIN(RADIANS([Calcoli.T21]+[Calcoli.T26]))-0.0047*SIN(RADIANS([Calcoli.T21]-[Calcoli.T26]))+0.0003*SIN(RADIANS(2*[Calcoli.T31]+[Calcoli.T21]))-0.0004*SIN(RADIANS(2*[Calcoli.T31]-[Calcoli.T21]))-0.0006*SIN(RADIANS(2*[Calcoli.T31]+[Calcoli.T26]))+0.0021*SIN(RADIANS(2*[Calcoli.T31]-[Calcoli.T26]))+0.0003*SIN(RADIANS([Calcoli.T21]+2*[Calcoli.T26]))+0.0004*SIN(RADIANS([Calcoli.T21]-2*[Calcoli.T26]))-0.0003*SIN(RADIANS(2*[Calcoli.T21]+[Calcoli.T26]));4)","v":-0.53},null,"Corr_PQ",{"$f":"of:=ROUND((0.1721-0.0004*[Calcoli.W12])*SIN(RADIANS([Calcoli.W21]))+0.0021*SIN(RADIANS(2*[Calcoli.W21]))-0.628*SIN(RADIANS([Calcoli.W26]))+0.0089*SIN(RADIANS(2*[Calcoli.W26]))-0.0004*SIN(RADIANS(3*[Calcoli.W26]))+0.0079*SIN(RADIANS(2*[Calcoli.W31]))-0.0119*SIN(RADIANS([Calcoli.W21]+[Calcoli.W26]))-0.0047*SIN(RADIANS([Calcoli.W21]-[Calcoli.W26]))+0.0003*SIN(RADIANS(2*[Calcoli.W31]+[Calcoli.W21]))-0.0004*SIN(RADIANS(2*[Calcoli.W31]-[Calcoli.W21]))-0.0006*SIN(RADIANS(2*[Calcoli.W31]+[Calcoli.W26]))+0.0021*SIN(RADIANS(2*[Calcoli.W31]-[Calcoli.W26]))+0.0003*SIN(RADIANS([Calcoli.W21]+2*[Calcoli.W26]))+0.0004*SIN(RADIANS([Calcoli.W21]-2*[Calcoli.W26]))-0.0003*SIN(RADIANS(2*[Calcoli.W21]+[Calcoli.W26]));4)","v":-0.5544},null,"Corr_PQ",{"$f":"of:=ROUND((0.1721-0.0004*[Calcoli.Z12])*SIN(RADIANS([Calcoli.Z21]))+0.0021*SIN(RADIANS(2*[Calcoli.Z21]))-0.628*SIN(RADIANS([Calcoli.Z26]))+0.0089*SIN(RADIANS(2*[Calcoli.Z26]))-0.0004*SIN(RADIANS(3*[Calcoli.Z26]))+0.0079*SIN(RADIANS(2*[Calcoli.Z31]))-0.0119*SIN(RADIANS([Calcoli.Z21]+[Calcoli.Z26]))-0.0047*SIN(RADIANS([Calcoli.Z21]-[Calcoli.Z26]))+0.0003*SIN(RADIANS(2*[Calcoli.Z31]+[Calcoli.Z21]))-0.0004*SIN(RADIANS(2*[Calcoli.Z31]-[Calcoli.Z21]))-0.0006*SIN(RADIANS(2*[Calcoli.Z31]+[Calcoli.Z26]))+0.0021*SIN(RADIANS(2*[Calcoli.Z31]-[Calcoli.Z26]))+0.0003*SIN(RADIANS([Calcoli.Z21]+2*[Calcoli.Z26]))+0.0004*SIN(RADIANS([Calcoli.Z21]-2*[Calcoli.Z26]))-0.0003*SIN(RADIANS(2*[Calcoli.Z21]+[Calcoli.Z26]));4)","v":-0.4792},null,"Corr_PQ",{"$f":"of:=ROUND((0.1721-0.0004*[Calcoli.AC12])*SIN(RADIANS([Calcoli.AC21]))+0.0021*SIN(RADIANS(2*[Calcoli.AC21]))-0.628*SIN(RADIANS([Calcoli.AC26]))+0.0089*SIN(RADIANS(2*[Calcoli.AC26]))-0.0004*SIN(RADIANS(3*[Calcoli.AC26]))+0.0079*SIN(RADIANS(2*[Calcoli.AC31]))-0.0119*SIN(RADIANS([Calcoli.AC21]+[Calcoli.AC26]))-0.0047*SIN(RADIANS([Calcoli.AC21]-[Calcoli.AC26]))+0.0003*SIN(RADIANS(2*[Calcoli.AC31]+[Calcoli.AC21]))-0.0004*SIN(RADIANS(2*[Calcoli.AC31]-[Calcoli.AC21]))-0.0006*SIN(RADIANS(2*[Calcoli.AC31]+[Calcoli.AC26]))+0.0021*SIN(RADIANS(2*[Calcoli.AC31]-[Calcoli.AC26]))+0.0003*SIN(RADIANS([Calcoli.AC21]+2*[Calcoli.AC26]))+0.0004*SIN(RADIANS([Calcoli.AC21]-2*[Calcoli.AC26]))-0.0003*SIN(RADIANS(2*[Calcoli.AC21]+[Calcoli.AC26]));4)","v":-0.3079},null,"Corr_PQ",{"$f":"of:=ROUND((0.1721-0.0004*[Calcoli.AF12])*SIN(RADIANS([Calcoli.AF21]))+0.0021*SIN(RADIANS(2*[Calcoli.AF21]))-0.628*SIN(RADIANS([Calcoli.AF26]))+0.0089*SIN(RADIANS(2*[Calcoli.AF26]))-0.0004*SIN(RADIANS(3*[Calcoli.AF26]))+0.0079*SIN(RADIANS(2*[Calcoli.AF31]))-0.0119*SIN(RADIANS([Calcoli.AF21]+[Calcoli.AF26]))-0.0047*SIN(RADIANS([Calcoli.AF21]-[Calcoli.AF26]))+0.0003*SIN(RADIANS(2*[Calcoli.AF31]+[Calcoli.AF21]))-0.0004*SIN(RADIANS(2*[Calcoli.AF31]-[Calcoli.AF21]))-0.0006*SIN(RADIANS(2*[Calcoli.AF31]+[Calcoli.AF26]))+0.0021*SIN(RADIANS(2*[Calcoli.AF31]-[Calcoli.AF26]))+0.0003*SIN(RADIANS([Calcoli.AF21]+2*[Calcoli.AF26]))+0.0004*SIN(RADIANS([Calcoli.AF21]-2*[Calcoli.AF26]))-0.0003*SIN(RADIANS(2*[Calcoli.AF21]+[Calcoli.AF26]));4)","v":-0.06},null,"Corr_PQ",{"$f":"of:=ROUND((0.1721-0.0004*[Calcoli.AI12])*SIN(RADIANS([Calcoli.AI21]))+0.0021*SIN(RADIANS(2*[Calcoli.AI21]))-0.628*SIN(RADIANS([Calcoli.AI26]))+0.0089*SIN(RADIANS(2*[Calcoli.AI26]))-0.0004*SIN(RADIANS(3*[Calcoli.AI26]))+0.0079*SIN(RADIANS(2*[Calcoli.AI31]))-0.0119*SIN(RADIANS([Calcoli.AI21]+[Calcoli.AI26]))-0.0047*SIN(RADIANS([Calcoli.AI21]-[Calcoli.AI26]))+0.0003*SIN(RADIANS(2*[Calcoli.AI31]+[Calcoli.AI21]))-0.0004*SIN(RADIANS(2*[Calcoli.AI31]-[Calcoli.AI21]))-0.0006*SIN(RADIANS(2*[Calcoli.AI31]+[Calcoli.AI26]))+0.0021*SIN(RADIANS(2*[Calcoli.AI31]-[Calcoli.AI26]))+0.0003*SIN(RADIANS([Calcoli.AI21]+2*[Calcoli.AI26]))+0.0004*SIN(RADIANS([Calcoli.AI21]-2*[Calcoli.AI26]))-0.0003*SIN(RADIANS(2*[Calcoli.AI21]+[Calcoli.AI26]));4)","v":0.2208},null,"Corr_PQ",{"$f":"of:=ROUND((0.1721-0.0004*[Calcoli.AL12])*SIN(RADIANS([Calcoli.AL21]))+0.0021*SIN(RADIANS(2*[Calcoli.AL21]))-0.628*SIN(RADIANS([Calcoli.AL26]))+0.0089*SIN(RADIANS(2*[Calcoli.AL26]))-0.0004*SIN(RADIANS(3*[Calcoli.AL26]))+0.0079*SIN(RADIANS(2*[Calcoli.AL31]))-0.0119*SIN(RADIANS([Calcoli.AL21]+[Calcoli.AL26]))-0.0047*SIN(RADIANS([Calcoli.AL21]-[Calcoli.AL26]))+0.0003*SIN(RADIANS(2*[Calcoli.AL31]+[Calcoli.AL21]))-0.0004*SIN(RADIANS(2*[Calcoli.AL31]-[Calcoli.AL21]))-0.0006*SIN(RADIANS(2*[Calcoli.AL31]+[Calcoli.AL26]))+0.0021*SIN(RADIANS(2*[Calcoli.AL31]-[Calcoli.AL26]))+0.0003*SIN(RADIANS([Calcoli.AL21]+2*[Calcoli.AL26]))+0.0004*SIN(RADIANS([Calcoli.AL21]-2*[Calcoli.AL26]))-0.0003*SIN(RADIANS(2*[Calcoli.AL21]+[Calcoli.AL26]));4)","v":0.4682},null,"Corr_PQ",{"$f":"of:=ROUND((0.1721-0.0004*[Calcoli.AO12])*SIN(RADIANS([Calcoli.AO21]))+0.0021*SIN(RADIANS(2*[Calcoli.AO21]))-0.628*SIN(RADIANS([Calcoli.AO26]))+0.0089*SIN(RADIANS(2*[Calcoli.AO26]))-0.0004*SIN(RADIANS(3*[Calcoli.AO26]))+0.0079*SIN(RADIANS(2*[Calcoli.AO31]))-0.0119*SIN(RADIANS([Calcoli.AO21]+[Calcoli.AO26]))-0.0047*SIN(RADIANS([Calcoli.AO21]-[Calcoli.AO26]))+0.0003*SIN(RADIANS(2*[Calcoli.AO31]+[Calcoli.AO21]))-0.0004*SIN(RADIANS(2*[Calcoli.AO31]-[Calcoli.AO21]))-0.0006*SIN(RADIANS(2*[Calcoli.AO31]+[Calcoli.AO26]))+0.0021*SIN(RADIANS(2*[Calcoli.AO31]-[Calcoli.AO26]))+0.0003*SIN(RADIANS([Calcoli.AO21]+2*[Calcoli.AO26]))+0.0004*SIN(RADIANS([Calcoli.AO21]-2*[Calcoli.AO26]))-0.0003*SIN(RADIANS(2*[Calcoli.AO21]+[Calcoli.AO26]));4)","v":0.627}]
["Corr_LP",{"$f":"of:=ROUND((0.1734-0.000393*[Calcoli.B13])*SIN(RADIANS([Calcoli.B22]))+0.0021*SIN(RADIANS(2*[Calcoli.B22]))-0.4068*SIN(RADIANS([Calcoli.B27]))+0.0161*SIN(RADIANS(2*[Calcoli.B27]))-0.0004*SIN(RADIANS(3*[Calcoli.B27]))+0.0104*SIN(RADIANS(2*[Calcoli.B32]))-0.0051*SIN(RADIANS([Calcoli.B22]+[Calcoli.B27]))-0.0074*SIN(RADIANS([Calcoli.B22]-[Calcoli.B27]))+0.0004*SIN(RADIANS(2*[Calcoli.B32]+[Calcoli.B22]))-0.0004*SIN(RADIANS(2*[Calcoli.B32]-[Calcoli.B22]))-0.0006*SIN(RADIANS(2*[Calcoli.B32]+[Calcoli.B27]))+0.001*SIN(RADIANS(2*[Calcoli.B32]-[Calcoli.B27]))+0.0005*SIN(RADIANS([Calcoli.B22]+2*[Calcoli.B27]));4)","v":-0.251},null,"Corr_LP",{"$f":"of:=ROUND((0.1734-0.000393*[Calcoli.E13])*SIN(RADIANS([Calcoli.E22]))+0.0021*SIN(RADIANS(2*[Calcoli.E22]))-0.4068*SIN(RADIANS([Calcoli.E27]))+0.0161*SIN(RADIANS(2*[Calcoli.E27]))-0.0004*SIN(RADIANS(3*[Calcoli.E27]))+0.0104*SIN(RADIANS(2*[Calcoli.E32]))-0.0051*SIN(RADIANS([Calcoli.E22]+[Calcoli.E27]))-0.0074*SIN(RADIANS([Calcoli.E22]-[Calcoli.E27]))+0.0004*SIN(RADIANS(2*[Calcoli.E32]+[Calcoli.E22]))-0.0004*SIN(RADIANS(2*[Calcoli.E32]-[Calcoli.E22]))-0.0006*SIN(RADIANS(2*[Calcoli.E32]+[Calcoli.E27]))+0.001*SIN(RADIANS(2*[Calcoli.E32]-[Calcoli.E27]))+0.0005*SIN(RADIANS([Calcoli.E22]+2*[Calcoli.E27]));4)","v":-0.3036},null,"Corr_LP",{"$f":"of:=ROUND((0.1734-0.000393*[Calcoli.H13])*SIN(RADIANS([Calcoli.H22]))+0.0021*SIN(RADIANS(2*[Calcoli.H22]))-0.4068*SIN(RADIANS([Calcoli.H27]))+0.0161*SIN(RADIANS(2*[Calcoli.H27]))-0.0004*SIN(RADIANS(3*[Calcoli.H27]))+0.0104*SIN(RADIANS(2*[Calcoli.H32]))-0.0051*SIN(RADIANS([Calcoli.H22]+[Calcoli.H27]))-0.0074*SIN(RADIANS([Calcoli.H22]-[Calcoli.H27]))+0.0004*SIN(RADIANS(2*[Calcoli.H32]+[Calcoli.H22]))-0.0004*SIN(RADIANS(2*[Calcoli.H32]-[Calcoli.H22]))-0.0006*SIN(RADIANS(2*[Calcoli.H32]+[Calcoli.H27]))+0.001*SIN(RADIANS(2*[Calcoli.H32]-[Calcoli.H27]))+0.0005*SIN(RADIANS([Calcoli.H22]+2*[Calcoli.H27]));4)","v":-0.2934},null,"Corr_LP",{"$f":"of:=ROUND((0.1734-0.000393*[Calcoli.K13])*SIN(RADIANS([Calcoli.K22]))+0.0021*SIN(RADIANS(2*[Calcoli.K22]))-0.4068*SIN(RADIANS([Calcoli.K27]))+0.0161*SIN(RADIANS(2*[Calcoli.K27]))-0.0004*SIN(RADIANS(3*[Calcoli.K27]))+0.0104*SIN(RADIANS(2*[Calcoli.K32]))-0.0051*SIN(RADIANS([Calcoli.K22]+[Calcoli.K27]))-0.0074*SIN(RADIANS([Calcoli.K22]-[Calcoli.K27]))+0.0004*SIN(RADIANS(2*[Calcoli.K32]+[Calcoli.K22]))-0.0004*SIN(RADIANS(2*[Calcoli.K32]-[Calcoli.K22]))-0.0006*SIN(RADIANS(2*[Calcoli.K32]+[Calcoli.K27]))+0.001*SIN(RADIANS(2*[Calcoli.K32]-[Calcoli.K27]))+0.0005*SIN(RADIANS([Calcoli.K22]+2*[Calcoli.K27]));4)","v":-0.2262},null,"Corr_LP",{"$f":"of:=ROUND((0.1734-0.000393*[Calcoli.N13])*SIN(RADIANS([Calcoli.N22]))+0.0021*SIN(RADIANS(2*[Calcoli.N22]))-0.4068*SIN(RADIANS([Calcoli.N27]))+0.0161*SIN(RADIANS(2*[Calcoli.N27]))-0.0004*SIN(RADIANS(3*[Calcoli.N27]))+0.0104*SIN(RADIANS(2*[Calcoli.N32]))-0.0051*SIN(RADIANS([Calcoli.N22]+[Calcoli.N27]))-0.0074*SIN(RADIANS([Calcoli.N22]-[Calcoli.N27]))+0.0004*SIN(RADIANS(2*[Calcoli.N32]+[Calcoli.N22]))-0.0004*SIN(RADIANS(2*[Calcoli.N32]-[Calcoli.N22]))-0.0006*SIN(RADIANS(2*[Calcoli.N32]+[Calcoli.N27]))+0.001*SIN(RADIANS(2*[Calcoli.N32]-[Calcoli.N27]))+0.0005*SIN(RADIANS([Calcoli.N22]+2*[Calcoli.N27]));4)","v":-0.1217},null,"Corr_LP",{"$f":"of:=ROUND((0.1734-0.000393*[Calcoli.Q13])*SIN(RADIANS([Calcoli.Q22]))+0.0021*SIN(RADIANS(2*[Calcoli.Q22]))-0.4068*SIN(RADIANS([Calcoli.Q27]))+0.0161*SIN(RADIANS(2*[Calcoli.Q27]))-0.0004*SIN(RADIANS(3*[Calcoli.Q27]))+0.0104*SIN(RADIANS(2*[Calcoli.Q32]))-0.0051*SIN(RADIANS([Calcoli.Q22]+[Calcoli.Q27]))-0.0074*SIN(RADIANS([Calcoli.Q22]-[Calcoli.Q27]))+0.0004*SIN(RADIANS(2*[Calcoli.Q32]+[Calcoli.Q22]))-0.0004*SIN(RADIANS(2*[Calcoli.Q32]-[Calcoli.Q22]))-0.0006*SIN(RADIANS(2*[Calcoli.Q32]+[Calcoli.Q27]))+0.001*SIN(RADIANS(2*[Calcoli.Q32]-[Calcoli.Q27]))+0.0005*SIN(RADIANS([Calcoli.Q22]+2*[Calcoli.Q27]));4)","v":-0.0032},null,"Corr_LP",{"$f":"of:=ROUND((0.1734-0.000393*[Calcoli.T13])*SIN(RADIANS([Calcoli.T22]))+0.0021*SIN(RADIANS(2*[Calcoli.T22]))-0.4068*SIN(RADIANS([Calcoli.T27]))+0.0161*SIN(RADIANS(2*[Calcoli.T27]))-0.0004*SIN(RADIANS(3*[Calcoli.T27]))+0.0104*SIN(RADIANS(2*[Calcoli.T32]))-0.0051*SIN(RADIANS([Calcoli.T22]+[Calcoli.T27]))-0.0074*SIN(RADIANS([Calcoli.T22]-[Calcoli.T27]))+0.0004*SIN(RADIANS(2*[Calcoli.T32]+[Calcoli.T22]))-0.0004*SIN(RADIANS(2*[Calcoli.T32]-[Calcoli.T22]))-0.0006*SIN(RADIANS(2*[Calcoli.T32]+[Calcoli.T27]))+0.001*SIN(RADIANS(2*[Calcoli.T32]-[Calcoli.T27]))+0.0005*SIN(RADIANS([Calcoli.T22]+2*[Calcoli.T27]));4)","v":0.1101},null,"Corr_LP",{"$f":"of:=ROUND((0.1734-0.000393*[Calcoli.W13])*SIN(RADIANS([Calcoli.W22]))+0.0021*SIN(RADIANS(2*[Calcoli.W22]))-0.4068*SIN(RADIANS([Calcoli.W27]))+0.0161*SIN(RADIANS(2*[Calcoli.W27]))-0.0004*SIN(RADIANS(3*[Calcoli.W27]))+0.0104*SIN(RADIANS(2*[Calcoli.W32]))-0.0051*SIN(RADIANS([Calcoli.W22]+[Calcoli.W27]))-0.0074*SIN(RADIANS([Calcoli.W22]-[Calcoli.W27]))+0.0004*SIN(RADIANS(2*[Calcoli.W32]+[Calcoli.W22]))-0.0004*SIN(RADIANS(2*[Calcoli.W32]-[Calcoli.W22]))-0.0006*SIN(RADIANS(2*[Calcoli.W32]+[Calcoli.W27]))+0.001*SIN(RADIANS(2*[Calcoli.W32]-[Calcoli.W27]))+0.0005*SIN(RADIANS([Calcoli.W22]+2*[Calcoli.W27]));4)","v":0.2026},null,"Corr_LP",{"$f":"of:=ROUND((0.1734-0.000393*[Calcoli.Z13])*SIN(RADIANS([Calcoli.Z22]))+0.0021*SIN(RADIANS(2*[Calcoli.Z22]))-0.4068*SIN(RADIANS([Calcoli.Z27]))+0.0161*SIN(RADIANS(2*[Calcoli.Z27]))-0.0004*SIN(RADIANS(3*[Calcoli.Z27]))+0.0104*SIN(RADIANS(2*[Calcoli.Z32]))-0.0051*SIN(RADIANS([Calcoli.Z22]+[Calcoli.Z27]))-0.0074*SIN(RADIANS([Calcoli.Z22]-[Calcoli.Z27]))+0.0004*SIN(RADIANS(2*[Calcoli.Z32]+[Calcoli.Z22]))-0.0004*SIN(RADIANS(2*[Calcoli.Z32]-[Calcoli.Z22]))-0.0006*SIN(RADIANS(2*[Calcoli.Z32]+[Calcoli.Z27]))+0.001*SIN(RADIANS(2*[Calcoli.Z32]-[Calcoli.Z27]))+0.0005*SIN(RADIANS([Calcoli.Z22]+2*[Calcoli.Z27]));4)","v":0.2584},null,"Corr_LP",{"$f":"of:=ROUND((0.1734-0.000393*[Calcoli.AC13])*SIN(RADIANS([Calcoli.AC22]))+0.0021*SIN(RADIANS(2*[Calcoli.AC22]))-0.4068*SIN(RADIANS([Calcoli.AC27]))+0.0161*SIN(RADIANS(2*[Calcoli.AC27]))-0.0004*SIN(RADIANS(3*[Calcoli.AC27]))+0.0104*SIN(RADIANS(2*[Calcoli.AC32]))-0.0051*SIN(RADIANS([Calcoli.AC22]+[Calcoli.AC27]))-0.0074*SIN(RADIANS([Calcoli.AC22]-[Calcoli.AC27]))+0.0004*SIN(RADIANS(2*[Calcoli.AC32]+[Calcoli.AC22]))-0.0004*SIN(RADIANS(2*[Calcoli.AC32]-[Calcoli.AC22]))-0.0006*SIN(RADIANS(2*[Calcoli.AC32]+[Calcoli.AC27]))+0.001*SIN(RADIANS(2*[Calcoli.AC32]-[Calcoli.AC27]))+0.0005*SIN(RADIANS([Calcoli.AC22]+2*[Calcoli.AC27]));4)","v":0.264},null,"Corr_LP",{"$f":"of:=ROUND((0.1734-0.000393*[Calcoli.AF13])*SIN(RADIANS([Calcoli.AF22]))+0.0021*SIN(RADIANS(2*[Calcoli.AF22]))-0.4068*SIN(RADIANS([Calcoli.AF27]))+0.0161*SIN(RADIANS(2*[Calcoli.AF27]))-0.0004*SIN(RADIANS(3*[Calcoli.AF27]))+0.0104*SIN(RADIANS(2*[Calcoli.AF32]))-0.0051*SIN(RADIANS([Calcoli.AF22]+[Calcoli.AF27]))-0.0074*SIN(RADIANS([Calcoli.AF22]-[Calcoli.AF27]))+0.0004*SIN(RADIANS(2*[Calcoli.AF32]+[Calcoli.AF22]))-0.0004*SIN(RADIANS(2*[Calcoli.AF32]-[Calcoli.AF22]))-0.0006*SIN(RADIANS(2*[Calcoli.AF32]+[Calcoli.AF27]))+0.001*SIN(RADIANS(2*[Calcoli.AF32]-[Calcoli.AF27]))+0.0005*SIN(RADIANS([Calcoli.AF22]+2*[Calcoli.AF27]));4)","v":0.2174},null,"Corr_LP",{"$f":"of:=ROUND((0.1734-0.000393*[Calcoli.AI13])*SIN(RADIANS([Calcoli.AI22]))+0.0021*SIN(RADIANS(2*[Calcoli.AI22]))-0.4068*SIN(RADIANS([Calcoli.AI27]))+0.0161*SIN(RADIANS(2*[Calcoli.AI27]))-0.0004*SIN(RADIANS(3*[Calcoli.AI27]))+0.0104*SIN(RADIANS(2*[Calcoli.AI32]))-0.0051*SIN(RADIANS([Calcoli.AI22]+[Calcoli.AI27]))-0.0074*SIN(RADIANS([Calcoli.AI22]-[Calcoli.AI27]))+0.0004*SIN(RADIANS(2*[Calcoli.AI32]+[Calcoli.AI22]))-0.0004*SIN(RADIANS(2*[Calcoli.AI32]-[Calcoli.AI22]))-0.0006*SIN(RADIANS(2*[Calcoli.AI32]+[Calcoli.AI27]))+0.001*SIN(RADIANS(2*[Calcoli.AI32]-[Calcoli.AI27]))+0.0005*SIN(RADIANS([Calcoli.AI22]+2*[Calcoli.AI27]));4)","v":0.133},null,"Corr_LP",{"$f":"of:=ROUND((0.1734-0.000393*[Calcoli.AL13])*SIN(RADIANS([Calcoli.AL22]))+0.0021*SIN(RADIANS(2*[Calcoli.AL22]))-0.4068*SIN(RADIANS([Calcoli.AL27]))+0.0161*SIN(RADIANS(2*[Calcoli.AL27]))-0.0004*SIN(RADIANS(3*[Calcoli.AL27]))+0.0104*SIN(RADIANS(2*[Calcoli.AL32]))-0.0051*SIN(RADIANS([Calcoli.AL22]+[Calcoli.AL27]))-0.0074*SIN(RADIANS([Calcoli.AL22]-[Calcoli.AL27]))+0.0004*SIN(RADIANS(2*[Calcoli.AL32]+[Calcoli.AL22]))-0.0004*SIN(RADIANS(2*[Calcoli.AL32]-[Calcoli.AL22]))-0.0006*SIN(RADIANS(2*[Calcoli.AL32]+[Calcoli.AL27]))+0.001*SIN(RADIANS(2*[Calcoli.AL32]-[Calcoli.AL27]))+0.0005*SIN(RADIANS([Calcoli.AL22]+2*[Calcoli.AL27]));4)","v":0.0358},null,"Corr_LP",{"$f":"of:=ROUND((0.1734-0.000393*[Calcoli.AO13])*SIN(RADIANS([Calcoli.AO22]))+0.0021*SIN(RADIANS(2*[Calcoli.AO22]))-0.4068*SIN(RADIANS([Calcoli.AO27]))+0.0161*SIN(RADIANS(2*[Calcoli.AO27]))-0.0004*SIN(RADIANS(3*[Calcoli.AO27]))+0.0104*SIN(RADIANS(2*[Calcoli.AO32]))-0.0051*SIN(RADIANS([Calcoli.AO22]+[Calcoli.AO27]))-0.0074*SIN(RADIANS([Calcoli.AO22]-[Calcoli.AO27]))+0.0004*SIN(RADIANS(2*[Calcoli.AO32]+[Calcoli.AO22]))-0.0004*SIN(RADIANS(2*[Calcoli.AO32]-[Calcoli.AO22]))-0.0006*SIN(RADIANS(2*[Calcoli.AO32]+[Calcoli.AO27]))+0.001*SIN(RADIANS(2*[Calcoli.AO32]-[Calcoli.AO27]))+0.0005*SIN(RADIANS([Calcoli.AO22]+2*[Calcoli.AO27]));4)","v":-0.1231}]
["Corr_UQ",{"$f":"of:=ROUND((0.1721-0.0004*[Calcoli.B14])*SIN(RADIANS([Calcoli.B23]))+0.0021*SIN(RADIANS(2*[Calcoli.B23]))-0.628*SIN(RADIANS([Calcoli.B28]))+0.0089*SIN(RADIANS(2*[Calcoli.B28]))-0.0004*SIN(RADIANS(3*[Calcoli.B28]))+0.0079*SIN(RADIANS(2*[Calcoli.B33]))-0.0119*SIN(RADIANS([Calcoli.B23]+[Calcoli.B28]))-0.0047*SIN(RADIANS([Calcoli.B23]-[Calcoli.B28]))+0.0003*SIN(RADIANS(2*[Calcoli.B33]+[Calcoli.B23]))-0.0004*SIN(RADIANS(2*[Calcoli.B33]-[Calcoli.B23]))-0.0006*SIN(RADIANS(2*[Calcoli.B33]+[Calcoli.B28]))+0.0021*SIN(RADIANS(2*[Calcoli.B33]-[Calcoli.B28]))+0.0003*SIN(RADIANS([Calcoli.B23]+2*[Calcoli.B28]))+0.0004*SIN(RADIANS([Calcoli.B23]-2*[Calcoli.B28]))-0.0003*SIN(RADIANS(2*[Calcoli.B23]+[Calcoli.B28]));4)","v":-0.5551},null,"Corr_UQ",{"$f":"of:=ROUND((0.1721-0.0004*[Calcoli.E14])*SIN(RADIANS([Calcoli.E23]))+0.0021*SIN(RADIANS(2*[Calcoli.E23]))-0.628*SIN(RADIANS([Calcoli.E28]))+0.0089*SIN(RADIANS(2*[Calcoli.E28]))-0.0004*SIN(RADIANS(3*[Calcoli.E28]))+0.0079*SIN(RADIANS(2*[Calcoli.E33]))-0.0119*SIN(RADIANS([Calcoli.E23]+[Calcoli.E28]))-0.0047*SIN(RADIANS([Calcoli.E23]-[Calcoli.E28]))+0.0003*SIN(RADIANS(2*[Calcoli.E33]+[Calcoli.E23]))-0.0004*SIN(RADIANS(2*[Calcoli.E33]-[Calcoli.E23]))-0.0006*SIN(RADIANS(2*[Calcoli.E33]+[Calcoli.E28]))+0.0021*SIN(RADIANS(2*[Calcoli.E33]-[Calcoli.E28]))+0.0003*SIN(RADIANS([Calcoli.E23]+2*[Calcoli.E28]))+0.0004*SIN(RADIANS([Calcoli.E23]-2*[Calcoli.E28]))-0.0003*SIN(RADIANS(2*[Calcoli.E23]+[Calcoli.E28]));4)","v":-0.2403},null,"Corr_UQ",{"$f":"of:=ROUND((0.1721-0.0004*[Calcoli.H14])*SIN(RADIANS([Calcoli.H23]))+0.0021*SIN(RADIANS(2*[Calcoli.H23]))-0.628*SIN(RADIANS([Calcoli.H28]))+0.0089*SIN(RADIANS(2*[Calcoli.H28]))-0.0004*SIN(RADIANS(3*[Calcoli.H28]))+0.0079*SIN(RADIANS(2*[Calcoli.H33]))-0.0119*SIN(RADIANS([Calcoli.H23]+[Calcoli.H28]))-0.0047*SIN(RADIANS([Calcoli.H23]-[Calcoli.H28]))+0.0003*SIN(RADIANS(2*[Calcoli.H33]+[Calcoli.H23]))-0.0004*SIN(RADIANS(2*[Calcoli.H33]-[Calcoli.H23]))-0.0006*SIN(RADIANS(2*[Calcoli.H33]+[Calcoli.H28]))+0.0021*SIN(RADIANS(2*[Calcoli.H33]-[Calcoli.H28]))+0.0003*SIN(RADIANS([Calcoli.H23]+2*[Calcoli.H28]))+0.0004*SIN(RADIANS([Calcoli.H23]-2*[Calcoli.H28]))-0.0003*SIN(RADIANS(2*[Calcoli.H23]+[Calcoli.H28]));4)","v":0.1187},null,"Corr_UQ",{"$f":"of:=ROUND((0.1721-0.0004*[Calcoli.K14])*SIN(RADIANS([Calcoli.K23]))+0.0021*SIN(RADIANS(2*[Calcoli.K23]))-0.628*SIN(RADIANS([Calcoli.K28]))+0.0089*SIN(RADIANS(2*[Calcoli.K28]))-0.0004*SIN(RADIANS(3*[Calcoli.K28]))+0.0079*SIN(RADIANS(2*[Calcoli.K33]))-0.0119*SIN(RADIANS([Calcoli.K23]+[Calcoli.K28]))-0.0047*SIN(RADIANS([Calcoli.K23]-[Calcoli.K28]))+0.0003*SIN(RADIANS(2*[Calcoli.K33]+[Calcoli.K23]))-0.0004*SIN(RADIANS(2*[Calcoli.K33]-[Calcoli.K23]))-0.0006*SIN(RADIANS(2*[Calcoli.K33]+[Calcoli.K28]))+0.0021*SIN(RADIANS(2*[Calcoli.K33]-[Calcoli.K28]))+0.0003*SIN(RADIANS([Calcoli.K23]+2*[Calcoli.K28]))+0.0004*SIN(RADIANS([Calcoli.K23]-2*[Calcoli.K28]))-0.0003*SIN(RADIANS(2*[Calcoli.K23]+[Calcoli.K28]));4)","v":0.4399},null,"Corr_UQ",{"$f":"of:=ROUND((0.1721-0.0004*[Calcoli.N14])*SIN(RADIANS([Calcoli.N23]))+0.0021*SIN(RADIANS(2*[Calcoli.N23]))-0.628*SIN(RADIANS([Calcoli.N28]))+0.0089*SIN(RADIANS(2*[Calcoli.N28]))-0.0004*SIN(RADIANS(3*[Calcoli.N28]))+0.0079*SIN(RADIANS(2*[Calcoli.N33]))-0.0119*SIN(RADIANS([Calcoli.N23]+[Calcoli.N28]))-0.0047*SIN(RADIANS([Calcoli.N23]-[Calcoli.N28]))+0.0003*SIN(RADIANS(2*[Calcoli.N33]+[Calcoli.N23]))-0.0004*SIN(RADIANS(2*[Calcoli.N33]-[Calcoli.N23]))-0.0006*SIN(RADIANS(2*[Calcoli.N33]+[Calcoli.N28]))+0.0021*SIN(RADIANS(2*[Calcoli.N33]-[Calcoli.N28]))+0.0003*SIN(RADIANS([Calcoli.N23]+2*[Calcoli.N28]))+0.0004*SIN(RADIANS([Calcoli.N23]-2*[Calcoli.N28]))-0.0003*SIN(RADIANS(2*[Calcoli.N23]+[Calcoli.N28]));4)","v":0.6586},null,"Corr_UQ",{"$f":"of:=ROUND((0.1721-0.0004*[Calcoli.Q14])*SIN(RADIANS([Calcoli.Q23]))+0.0021*SIN(RADIANS(2*[Calcoli.Q23]))-0.628*SIN(RADIANS([Calcoli.Q28]))+0.0089*SIN(RADIANS(2*[Calcoli.Q28]))-0.0004*SIN(RADIANS(3*[Calcoli.Q28]))+0.0079*SIN(RADIANS(2*[Calcoli.Q33]))-0.0119*SIN(RADIANS([Calcoli.Q23]+[Calcoli.Q28]))-0.0047*SIN(RADIANS([Calcoli.Q23]-[Calcoli.Q28]))+0.0003*SIN(RADIANS(2*[Calcoli.Q33]+[Calcoli.Q23]))-0.0004*SIN(RADIANS(2*[Calcoli.Q33]-[Calcoli.Q23]))-0.0006*SIN(RADIANS(2*[Calcoli.Q33]+[Calcoli.Q28]))+0.0021*SIN(RADIANS(2*[Calcoli.Q33]-[Calcoli.Q28]))+0.0003*SIN(RADIANS([Calcoli.Q23]+2*[Calcoli.Q28]))+0.0004*SIN(RADIANS([Calcoli.Q23]-2*[Calcoli.Q28]))-0.0003*SIN(RADIANS(2*[Calcoli.Q23]+[Calcoli.Q28]));4)","v":0.7363},null,"Corr_UQ",{"$f":"of:=ROUND((0.1721-0.0004*[Calcoli.T14])*SIN(RADIANS([Calcoli.T23]))+0.0021*SIN(RADIANS(2*[Calcoli.T23]))-0.628*SIN(RADIANS([Calcoli.T28]))+0.0089*SIN(RADIANS(2*[Calcoli.T28]))-0.0004*SIN(RADIANS(3*[Calcoli.T28]))+0.0079*SIN(RADIANS(2*[Calcoli.T33]))-0.0119*SIN(RADIANS([Calcoli.T23]+[Calcoli.T28]))-0.0047*SIN(RADIANS([Calcoli.T23]-[Calcoli.T28]))+0.0003*SIN(RADIANS(2*[Calcoli.T33]+[Calcoli.T23]))-0.0004*SIN(RADIANS(2*[Calcoli.T33]-[Calcoli.T23]))-0.0006*SIN(RADIANS(2*[Calcoli.T33]+[Calcoli.T28]))+0.0021*SIN(RADIANS(2*[Calcoli.T33]-[Calcoli.T28]))+0.0003*SIN(RADIANS([Calcoli.T23]+2*[Calcoli.T28]))+0.0004*SIN(RADIANS([Calcoli.T23]-2*[Calcoli.T28]))-0.0003*SIN(RADIANS(2*[Calcoli.T23]+[Calcoli.T28]));4)","v":0.6639},null,"Corr_UQ",{"$f":"of:=ROUND((0.1721-0.0004*[Calcoli.W14])*SIN(RADIANS([Calcoli.W23]))+0.0021*SIN(RADIANS(2*[Calcoli.W23]))-0.628*SIN(RADIANS([Calcoli.W28]))+0.0089*SIN(RADIANS(2*[Calcoli.W28]))-0.0004*SIN(RADIANS(3*[Calcoli.W28]))+0.0079*SIN(RADIANS(2*[Calcoli.W33]))-0.0119*SIN(RADIANS([Calcoli.W23]+[Calcoli.W28]))-0.0047*SIN(RADIANS([Calcoli.W23]-[Calcoli.W28]))+0.0003*SIN(RADIANS(2*[Calcoli.W33]+[Calcoli.W23]))-0.0004*SIN(RADIANS(2*[Calcoli.W33]-[Calcoli.W23]))-0.0006*SIN(RADIANS(2*[Calcoli.W33]+[Calcoli.W28]))+0.0021*SIN(RADIANS(2*[Calcoli.W33]-[Calcoli.W28]))+0.0003*SIN(RADIANS([Calcoli.W23]+2*[Calcoli.W28]))+0.0004*SIN(RADIANS([Calcoli.W23]-2*[Calcoli.W28]))-0.0003*SIN(RADIANS(2*[Calcoli.W23]+[Calcoli.W28]));4)","v":0.4616},null,"Corr_UQ",{"$f":"of:=ROUND((0.1721-0.0004*[Calcoli.Z14])*SIN(RADIANS([Calcoli.Z23]))+0.0021*SIN(RADIANS(2*[Calcoli.Z23]))-0.628*SIN(RADIANS([Calcoli.Z28]))+0.0089*SIN(RADIANS(2*[Calcoli.Z28]))-0.0004*SIN(RADIANS(3*[Calcoli.Z28]))+0.0079*SIN(RADIANS(2*[Calcoli.Z33]))-0.0119*SIN(RADIANS([Calcoli.Z23]+[Calcoli.Z28]))-0.0047*SIN(RADIANS([Calcoli.Z23]-[Calcoli.Z28]))+0.0003*SIN(RADIANS(2*[Calcoli.Z33]+[Calcoli.Z23]))-0.0004*SIN(RADIANS(2*[Calcoli.Z33]-[Calcoli.Z23]))-0.0006*SIN(RADIANS(2*[Calcoli.Z33]+[Calcoli.Z28]))+0.0021*SIN(RADIANS(2*[Calcoli.Z33]-[Calcoli.Z28]))+0.0003*SIN(RADIANS([Calcoli.Z23]+2*[Calcoli.Z28]))+0.0004*SIN(RADIANS([Calcoli.Z23]-2*[Calcoli.Z28]))-0.0003*SIN(RADIANS(2*[Calcoli.Z23]+[Calcoli.Z28]));4)","v":0.1736},null,"Corr_UQ",{"$f":"of:=ROUND((0.1721-0.0004*[Calcoli.AC14])*SIN(RADIANS([Calcoli.AC23]))+0.0021*SIN(RADIANS(2*[Calcoli.AC23]))-0.628*SIN(RADIANS([Calcoli.AC28]))+0.0089*SIN(RADIANS(2*[Calcoli.AC28]))-0.0004*SIN(RADIANS(3*[Calcoli.AC28]))+0.0079*SIN(RADIANS(2*[Calcoli.AC33]))-0.0119*SIN(RADIANS([Calcoli.AC23]+[Calcoli.AC28]))-0.0047*SIN(RADIANS([Calcoli.AC23]-[Calcoli.AC28]))+0.0003*SIN(RADIANS(2*[Calcoli.AC33]+[Calcoli.AC23]))-0.0004*SIN(RADIANS(2*[Calcoli.AC33]-[Calcoli.AC23]))-0.0006*SIN(RADIANS(2*[Calcoli.AC33]+[Calcoli.AC28]))+0.0021*SIN(RADIANS(2*[Calcoli.AC33]-[Calcoli.AC28]))+0.0003*SIN(RADIANS([Calcoli.AC23]+2*[Calcoli.AC28]))+0.0004*SIN(RADIANS([Calcoli.AC23]-2*[Calcoli.AC28]))-0.0003*SIN(RADIANS(2*[Calcoli.AC23]+[Calcoli.AC28]));4)","v":-0.142},null,"Corr_UQ",{"$f":"of:=ROUND((0.1721-0.0004*[Calcoli.AF14])*SIN(RADIANS([Calcoli.AF23]))+0.0021*SIN(RADIANS(2*[Calcoli.AF23]))-0.628*SIN(RADIANS([Calcoli.AF28]))+0.0089*SIN(RADIANS(2*[Calcoli.AF28]))-0.0004*SIN(RADIANS(3*[Calcoli.AF28]))+0.0079*SIN(RADIANS(2*[Calcoli.AF33]))-0.0119*SIN(RADIANS([Calcoli.AF23]+[Calcoli.AF28]))-0.0047*SIN(RADIANS([Calcoli.AF23]-[Calcoli.AF28]))+0.0003*SIN(RADIANS(2*[Calcoli.AF33]+[Calcoli.AF23]))-0.0004*SIN(RADIANS(2*[Calcoli.AF33]-[Calcoli.AF23]))-0.0006*SIN(RADIANS(2*[Calcoli.AF33]+[Calcoli.AF28]))+0.0021*SIN(RADIANS(2*[Calcoli.AF33]-[Calcoli.AF28]))+0.0003*SIN(RADIANS([Calcoli.AF23]+2*[Calcoli.AF28]))+0.0004*SIN(RADIANS([Calcoli.AF23]-2*[Calcoli.AF28]))-0.0003*SIN(RADIANS(2*[Calcoli.AF23]+[Calcoli.AF28]));4)","v":-0.4224},null,"Corr_UQ",{"$f":"of:=ROUND((0.1721-0.0004*[Calcoli.AI14])*SIN(RADIANS([Calcoli.AI23]))+0.0021*SIN(RADIANS(2*[Calcoli.AI23]))-0.628*SIN(RADIANS([Calcoli.AI28]))+0.0089*SIN(RADIANS(2*[Calcoli.AI28]))-0.0004*SIN(RADIANS(3*[Calcoli.AI28]))+0.0079*SIN(RADIANS(2*[Calcoli.AI33]))-0.0119*SIN(RADIANS([Calcoli.AI23]+[Calcoli.AI28]))-0.0047*SIN(RADIANS([Calcoli.AI23]-[Calcoli.AI28]))+0.0003*SIN(RADIANS(2*[Calcoli.AI33]+[Calcoli.AI23]))-0.0004*SIN(RADIANS(2*[Calcoli.AI33]-[Calcoli.AI23]))-0.0006*SIN(RADIANS(2*[Calcoli.AI33]+[Calcoli.AI28]))+0.0021*SIN(RADIANS(2*[Calcoli.AI33]-[Calcoli.AI28]))+0.0003*SIN(RADIANS([Calcoli.AI23]+2*[Calcoli.AI28]))+0.0004*SIN(RADIANS([Calcoli.AI23]-2*[Calcoli.AI28]))-0.0003*SIN(RADIANS(2*[Calcoli.AI23]+[Calcoli.AI28]));4)","v":-0.6122},null,"Corr_UQ",{"$f":"of:=ROUND((0.1721-0.0004*[Calcoli.AL14])*SIN(RADIANS([Calcoli.AL23]))+0.0021*SIN(RADIANS(2*[Calcoli.AL23]))-0.628*SIN(RADIANS([Calcoli.AL28]))+0.0089*SIN(RADIANS(2*[Calcoli.AL28]))-0.0004*SIN(RADIANS(3*[Calcoli.AL28]))+0.0079*SIN(RADIANS(2*[Calcoli.AL33]))-0.0119*SIN(RADIANS([Calcoli.AL23]+[Calcoli.AL28]))-0.0047*SIN(RADIANS([Calcoli.AL23]-[Calcoli.AL28]))+0.0003*SIN(RADIANS(2*[Calcoli.AL33]+[Calcoli.AL23]))-0.0004*SIN(RADIANS(2*[Calcoli.AL33]-[Calcoli.AL23]))-0.0006*SIN(RADIANS(2*[Calcoli.AL33]+[Calcoli.AL28]))+0.0021*SIN(RADIANS(2*[Calcoli.AL33]-[Calcoli.AL28]))+0.0003*SIN(RADIANS([Calcoli.AL23]+2*[Calcoli.AL28]))+0.0004*SIN(RADIANS([Calcoli.AL23]-2*[Calcoli.AL28]))-0.0003*SIN(RADIANS(2*[Calcoli.AL23]+[Calcoli.AL28]));4)","v":-0.6745},null,"Corr_UQ",{"$f":"of:=ROUND((0.1721-0.0004*[Calcoli.AO14])*SIN(RADIANS([Calcoli.AO23]))+0.0021*SIN(RADIANS(2*[Calcoli.AO23]))-0.628*SIN(RADIANS([Calcoli.AO28]))+0.0089*SIN(RADIANS(2*[Calcoli.AO28]))-0.0004*SIN(RADIANS(3*[Calcoli.AO28]))+0.0079*SIN(RADIANS(2*[Calcoli.AO33]))-0.0119*SIN(RADIANS([Calcoli.AO23]+[Calcoli.AO28]))-0.0047*SIN(RADIANS([Calcoli.AO23]-[Calcoli.AO28]))+0.0003*SIN(RADIANS(2*[Calcoli.AO33]+[Calcoli.AO23]))-0.0004*SIN(RADIANS(2*[Calcoli.AO33]-[Calcoli.AO23]))-0.0006*SIN(RADIANS(2*[Calcoli.AO33]+[Calcoli.AO28]))+0.0021*SIN(RADIANS(2*[Calcoli.AO33]-[Calcoli.AO28]))+0.0003*SIN(RADIANS([Calcoli.AO23]+2*[Calcoli.AO28]))+0.0004*SIN(RADIANS([Calcoli.AO23]-2*[Calcoli.AO28]))-0.0003*SIN(RADIANS(2*[Calcoli.AO23]+[Calcoli.AO28]));4)","v":-0.4007}]
["LN",{"$f":"of:=ROUND([Calcoli.B15]+[Calcoli.B34];4)","v":2457722.0136},null,"LN",{"$f":"of:=ROUND([Calcoli.E15]+[Calcoli.E34];4)","v":2457751.7877},null,"LN",{"$f":"of:=ROUND([Calcoli.H15]+[Calcoli.H34];4)","v":2457781.5059},null,"LN",{"$f":"of:=ROUND([Calcoli.K15]+[Calcoli.K34];4)","v":2457811.1253},null,"LN",{"$f":"of:=ROUND([Calcoli.N15]+[Calcoli.N34];4)","v":2457840.6247},null,"LN",{"$f":"of:=ROUND([Calcoli.Q15]+[Calcoli.Q34];4)","v":2457870.0128},null,"LN",{"$f":"of:=ROUND([Calcoli.T15]+[Calcoli.T34];4)","v":2457899.324},null,"LN",{"$f":"of:=ROUND([Calcoli.W15]+[Calcoli.W34];4)","v":2457928.6063},null,"LN",{"$f":"of:=ROUND([Calcoli.Z15]+[Calcoli.Z34];4)","v":2457957.9082},null,"LN",{"$f":"of:=ROUND([Calcoli.AC15]+[Calcoli.AC34];4)","v":2457987.2722},null,"LN",{"$f":"of:=ROUND([Calcoli.AF15]+[Calcoli.AF34];4)","v":2458016.73},null,"LN",{"$f":"of:=ROUND([Calcoli.AI15]+[Calcoli.AI34];4)","v":2458046.3008},null,"LN",{"$f":"of:=ROUND([Calcoli.AL15]+[Calcoli.AL34];4)","v":2458075.9885},null,"LN",{"$f":"of:=ROUND([Calcoli.AO15]+[Calcoli.AO34];4)","v":2458135.5965}]
["PQ",{"$f":"of:=ROUND([Calcoli.B16]+[Calcoli.B35];4)","v":2457729.8752},null,"PQ",{"$f":"of:=ROUND([Calcoli.E16]+[Calcoli.E35];4)","v":2457759.3222},null,"PQ",{"$f":"of:=ROUND([Calcoli.H16]+[Calcoli.H35];4)","v":2457788.6777},null,"PQ",{"$f":"of:=ROUND([Calcoli.K16]+[Calcoli.K35];4)","v":2457817.9789},null,"PQ",{"$f":"of:=ROUND([Calcoli.N16]+[Calcoli.N35];4)","v":2457847.2756},null,"PQ",{"$f":"of:=ROUND([Calcoli.Q16]+[Calcoli.Q35];4)","v":2457876.6139},null,"PQ",{"$f":"of:=ROUND([Calcoli.T16]+[Calcoli.T35];4)","v":2457906.0269},null,"PQ",{"$f":"of:=ROUND([Calcoli.W16]+[Calcoli.W35];4)","v":2457935.5331},null,"PQ",{"$f":"of:=ROUND([Calcoli.Z16]+[Calcoli.Z35];4)","v":2457965.1389},null,"PQ",{"$f":"of:=ROUND([Calcoli.AC16]+[Calcoli.AC35];4)","v":2457994.8409},null,"PQ",{"$f":"of:=ROUND([Calcoli.AF16]+[Calcoli.AF35];4)","v":2458024.6194},null,"PQ",{"$f":"of:=ROUND([Calcoli.AI16]+[Calcoli.AI35];4)","v":2458054.4308},null,"PQ",{"$f":"of:=ROUND([Calcoli.AL16]+[Calcoli.AL35];4)","v":2458084.2088},null,"PQ",{"$f":"of:=ROUND([Calcoli.AO16]+[Calcoli.AO35];4)","v":2458143.4289}]
["LP",{"$f":"of:=ROUND([Calcoli.B17]+[Calcoli.B36];4)","v":2457736.5048},null,"LP",{"$f":"of:=ROUND([Calcoli.E17]+[Calcoli.E36];4)","v":2457765.9828},null,"LP",{"$f":"of:=ROUND([Calcoli.H17]+[Calcoli.H36];4)","v":2457795.5237},null,"LP",{"$f":"of:=ROUND([Calcoli.K17]+[Calcoli.K36];4)","v":2457825.1215},null,"LP",{"$f":"of:=ROUND([Calcoli.N17]+[Calcoli.N36];4)","v":2457854.7566},null,"LP",{"$f":"of:=ROUND([Calcoli.Q17]+[Calcoli.Q36];4)","v":2457884.4057},null,"LP",{"$f":"of:=ROUND([Calcoli.T17]+[Calcoli.T36];4)","v":2457914.0497},null,"LP",{"$f":"of:=ROUND([Calcoli.W17]+[Calcoli.W36];4)","v":2457943.6728},null,"LP",{"$f":"of:=ROUND([Calcoli.Z17]+[Calcoli.Z36];4)","v":2457973.2592},null,"LP",{"$f":"of:=ROUND([Calcoli.AC17]+[Calcoli.AC36];4)","v":2458002.7954},null,"LP",{"$f":"of:=ROUND([Calcoli.AF17]+[Calcoli.AF36];4)","v":2458032.2794},null,"LP",{"$f":"of:=ROUND([Calcoli.AI17]+[Calcoli.AI36];4)","v":2458061.7257},null,"LP",{"$f":"of:=ROUND([Calcoli.AL17]+[Calcoli.AL36];4)","v":2458091.1591},null,"LP",{"$f":"of:=ROUND([Calcoli.AO17]+[Calcoli.AO36];4)","v":2458150.0614}]
["UQ",{"$f":"of:=ROUND([Calcoli.B18]+[Calcoli.B37];4)","v":2457743.5834},null,"UQ",{"$f":"of:=ROUND([Calcoli.E18]+[Calcoli.E37];4)","v":2457773.4288},null,"UQ",{"$f":"of:=ROUND([Calcoli.H18]+[Calcoli.H37];4)","v":2457803.3184},null,"UQ",{"$f":"of:=ROUND([Calcoli.K18]+[Calcoli.K37];4)","v":2457833.1702},null,"UQ",{"$f":"of:=ROUND([Calcoli.N18]+[Calcoli.N37];4)","v":2457862.9196},null,"UQ",{"$f":"of:=ROUND([Calcoli.Q18]+[Calcoli.Q37];4)","v":2457892.5279},null,"UQ",{"$f":"of:=ROUND([Calcoli.T18]+[Calcoli.T37];4)","v":2457921.9861},null,"UQ",{"$f":"of:=ROUND([Calcoli.W18]+[Calcoli.W37];4)","v":2457951.3144},null,"UQ",{"$f":"of:=ROUND([Calcoli.Z18]+[Calcoli.Z37];4)","v":2457980.5571},null,"UQ",{"$f":"of:=ROUND([Calcoli.AC18]+[Calcoli.AC37];4)","v":2458009.7721},null,"UQ",{"$f":"of:=ROUND([Calcoli.AF18]+[Calcoli.AF37];4)","v":2458039.0223},null,"UQ",{"$f":"of:=ROUND([Calcoli.AI18]+[Calcoli.AI37];4)","v":2458068.3631},null,"UQ",{"$f":"of:=ROUND([Calcoli.AL18]+[Calcoli.AL37];4)","v":2458097.8314},null,"UQ",{"$f":"of:=ROUND([Calcoli.AO18]+[Calcoli.AO37];4)","v":2458157.1665}]
["GD_DATA",{"$f":"of:=\"2003,110100\"","v":"2003,110100"},null,"GD_DATA",{"$f":"of:=\"2003,110100\"","v":"2003,110100"},null,"GD_DATA",{"$f":"of:=\"2003,110100\"","v":"2003,110100"},null,"GD_DATA",{"$f":"of:=\"2003,110100\"","v":"2003,110100"},null,"GD_DATA",{"$f":"of:=\"2003,110100\"","v":"2003,110100"},null,"GD_DATA",{"$f":"of:=\"2003,110100\"","v":"2003,110100"},null,"GD_DATA",{"$f":"of:=\"2003,110100\"","v":"2003,110100"},null,"GD_DATA",{"$f":"of:=\"2003,110100\"","v":"2003,110100"},null,"GD_DATA",{"$f":"of:=\"2003,110100\"","v":"2003,110100"},null,"GD_DATA",{"$f":"of:=\"2003,110100\"","v":"2003,110100"},null,"GD_DATA",{"$f":"of:=\"2003,110100\"","v":"2003,110100"},null,"GD_DATA",{"$f":"of:=\"2003,110100\"","v":"2003,110100"},null,"GD_DATA",{"$f":"of:=\"2003,110100\"","v":"2003,110100"},null,"GD_DATA",{"$f":"of:=\"2003,110100\"","v":"2003,110100"}]
["YYYY",{"$f":"of:=IF(LEFT(RIGHT([Calcoli.B42];6);2)>2;INT([Calcoli.B42]);INT([Calcoli.B42])-1)","v":2003},null,"YYYY",{"$f":"of:=IF(LEFT(RIGHT([Calcoli.E42];6);2)>2;INT([Calcoli.E42]);INT([Calcoli.E42])-1)","v":2003},null,"YYYY",{"$f":"of:=IF(LEFT(RIGHT([Calcoli.H42];6);2)>2;INT([Calcoli.H42]);INT([Calcoli.H42])-1)","v":2003},null,"YYYY",{"$f":"of:=IF(LEFT(RIGHT([Calcoli.K42];6);2)>2;INT([Calcoli.K42]);INT([Calcoli.K42])-1)","v":2003},null,"YYYY",{"$f":"of:=IF(LEFT(RIGHT([Calcoli.N42];6);2)>2;INT([Calcoli.N42]);INT([Calcoli.N42])-1)","v":2003},null,"YYYY",{"$f":"of:=IF(LEFT(RIGHT([Calcoli.Q42];6);2)>2;INT([Calcoli.Q42]);INT([Calcoli.Q42])-1)","v":2003},null,"YYYY",{"$f":"of:=IF(LEFT(RIGHT([Calcoli.T42];6);2)>2;INT([Calcoli.T42]);INT([Calcoli.T42])-1)","v":2003},null,"YYYY",{"$f":"of:=IF(LEFT(RIGHT([Calcoli.W42];6);2)>2;INT([Calcoli.W42]);INT([Calcoli.W42])-1)","v":2003},null,"YYYY",{"$f":"of:=IF(LEFT(RIGHT([Calcoli.Z42];6);2)>2;INT([Calcoli.Z42]);INT([Calcoli.Z42])-1)","v":2003},null,"YYYY",{"$f":"of:=IF(LEFT(RIGHT([Calcoli.AC42];6);2)>2;INT([Calcoli.AC42]);INT([Calcoli.AC42])-1)","v":2003},null,"YYYY",{"$f":"of:=IF(LEFT(RIGHT([Calcoli.AF42];6);2)>2;INT([Calcoli.AF42]);INT([Calcoli.AF42])-1)","v":2003},null,"YYYY",{"$f":"of:=IF(LEFT(RIGHT([Calcoli.AI42];6);2)>2;INT([Calcoli.AI42]);INT([Calcoli.AI42])-1)","v":2003},null,"YYYY",{"$f":"of:=IF(LEFT(RIGHT([Calcoli.AL42];6);2)>2;INT([Calcoli.AL42]);INT([Calcoli.AL42])-1)","v":2003},null,"YYYY",{"$f":"of:=IF(LEFT(RIGHT([Calcoli.AO42];6);2)>2;INT([Calcoli.AO42]);INT([Calcoli.AO42])-1)","v":2003}]
["MM",{"$f":"of:=IF(LEFT(RIGHT([Calcoli.B42];6);2)>2;LEFT(RIGHT([Calcoli.B42];6);2);LEFT(RIGHT([Calcoli.B42];6);2)+12)","v":"11"},null,"MM",{"$f":"of:=IF(LEFT(RIGHT([Calcoli.E42];6);2)>2;LEFT(RIGHT([Calcoli.E42];6);2);LEFT(RIGHT([Calcoli.E42];6);2)+12)","v":"11"},null,"MM",{"$f":"of:=IF(LEFT(RIGHT([Calcoli.H42];6);2)>2;LEFT(RIGHT([Calcoli.H42];6);2);LEFT(RIGHT([Calcoli.H42];6);2)+12)","v":"11"},null,"MM",{"$f":"of:=IF(LEFT(RIGHT([Calcoli.K42];6);2)>2;LEFT(RIGHT([Calcoli.K42];6);2);LEFT(RIGHT([Calcoli.K42];6);2)+12)","v":"11"},null,"MM",{"$f":"of:=IF(LEFT(RIGHT([Calcoli.N42];6);2)>2;LEFT(RIGHT([Calcoli.N42];6);2);LEFT(RIGHT([Calcoli.N42];6);2)+12)","v":"11"},null,"MM",{"$f":"of:=IF(LEFT(RIGHT([Calcoli.Q42];6);2)>2;LEFT(RIGHT([Calcoli.Q42];6);2);LEFT(RIGHT([Calcoli.Q42];6);2)+12)","v":"11"},null,"MM",{"$f":"of:=IF(LEFT(RIGHT([Calcoli.T42];6);2)>2;LEFT(RIGHT([Calcoli.T42];6);2);LEFT(RIGHT([Calcoli.T42];6);2)+12)","v":"11"},null,"MM",{"$f":"of:=IF(LEFT(RIGHT([Calcoli.W42];6);2)>2;LEFT(RIGHT([Calcoli.W42];6);2);LEFT(RIGHT([Calcoli.W42];6);2)+12)","v":"11"},null,"MM",{"$f":"of:=IF(LEFT(RIGHT([Calcoli.Z42];6);2)>2;LEFT(RIGHT([Calcoli.Z42];6);2);LEFT(RIGHT([Calcoli.Z42];6);2)+12)","v":"11"},null,"MM",{"$f":"of:=IF(LEFT(RIGHT([Calcoli.AC42];6);2)>2;LEFT(RIGHT([Calcoli.AC42];6);2);LEFT(RIGHT([Calcoli.AC42];6);2)+12)","v":"11"},null,"MM",{"$f":"of:=IF(LEFT(RIGHT([Calcoli.AF42];6);2)>2;LEFT(RIGHT([Calcoli.AF42];6);2);LEFT(RIGHT([Calcoli.AF42];6);2)+12)","v":"11"},null,"MM",{"$f":"of:=IF(LEFT(RIGHT([Calcoli.AI42];6);2)>2;LEFT(RIGHT([Calcoli.AI42];6);2);LEFT(RIGHT([Calcoli.AI42];6);2)+12)","v":"11"},null,"MM",{"$f":"of:=IF(LEFT(RIGHT([Calcoli.AL42];6);2)>2;LEFT(RIGHT([Calcoli.AL42];6);2);LEFT(RIGHT([Calcoli.AL42];6);2)+12)","v":"11"},null,"MM",{"$f":"of:=IF(LEFT(RIGHT([Calcoli.AO42];6);2)>2;LEFT(RIGHT([Calcoli.AO42];6);2);LEFT(RIGHT([Calcoli.AO42];6);2)+12)","v":"11"}]
["DD_dd",{"$f":"of:=LEFT(RIGHT([Calcoli.B42];4);2)+(RIGHT([Calcoli.B42];2)/100)","v":1},null,"DD_dd",{"$f":"of:=LEFT(RIGHT([Calcoli.E42];4);2)+(RIGHT([Calcoli.E42];2)/100)","v":1},null,"DD_dd",{"$f":"of:=LEFT(RIGHT([Calcoli.H42];4);2)+(RIGHT([Calcoli.H42];2)/100)","v":1},null,"DD_dd",{"$f":"of:=LEFT(RIGHT([Calcoli.K42];4);2)+(RIGHT([Calcoli.K42];2)/100)","v":1},null,"DD_dd",{"$f":"of:=LEFT(RIGHT([Calcoli.N42];4);2)+(RIGHT([Calcoli.N42];2)/100)","v":1},null,"DD_dd",{"$f":"of:=LEFT(RIGHT([Calcoli.Q42];4);2)+(RIGHT([Calcoli.Q42];2)/100)","v":1},null,"DD_dd",{"$f":"of:=LEFT(RIGHT([Calcoli.T42];4);2)+(RIGHT([Calcoli.T42];2)/100)","v":1},null,"DD_dd",{"$f":"of:=LEFT(RIGHT([Calcoli.W42];4);2)+(RIGHT([Calcoli.W42];2)/100)","v":1},null,"DD_dd",{"$f":"of:=LEFT(RIGHT([Calcoli.Z42];4);2)+(RIGHT([Calcoli.Z42];2)/100)","v":1},null,"DD_dd",{"$f":"of:=LEFT(RIGHT([Calcoli.AC42];4);2)+(RIGHT([Calcoli.AC42];2)/100)","v":1},null,"DD_dd",{"$f":"of:=LEFT(RIGHT([Calcoli.AF42];4);2)+(RIGHT([Calcoli.AF42];2)/100)","v":1},null,"DD_dd",{"$f":"of:=LEFT(RIGHT([Calcoli.AI42];4);2)+(RIGHT([Calcoli.AI42];2)/100)","v":1},null,"DD_dd",{"$f":"of:=LEFT(RIGHT([Calcoli.AL42];4);2)+(RIGHT([Calcoli.AL42];2)/100)","v":1},null,"DD_dd",{"$f":"of:=LEFT(RIGHT([Calcoli.AO42];4);2)+(RIGHT([Calcoli.AO42];2)/100)","v":1}]
["A",{"$f":"of:=IF([Calcoli.B42]<1582.1015;0;INT([Calcoli.B43]/100))","v":20},null,"A",{"$f":"of:=IF([Calcoli.E42]<1582.1015;0;INT([Calcoli.E43]/100))","v":20},null,"A",{"$f":"of:=IF([Calcoli.H42]<1582.1015;0;INT([Calcoli.H43]/100))","v":20},null,"A",{"$f":"of:=IF([Calcoli.K42]<1582.1015;0;INT([Calcoli.K43]/100))","v":20},null,"A",{"$f":"of:=IF([Calcoli.N42]<1582.1015;0;INT([Calcoli.N43]/100))","v":20},null,"A",{"$f":"of:=IF([Calcoli.Q42]<1582.1015;0;INT([Calcoli.Q43]/100))","v":20},null,"A",{"$f":"of:=IF([Calcoli.T42]<1582.1015;0;INT([Calcoli.T43]/100))","v":20},null,"A",{"$f":"of:=IF([Calcoli.W42]<1582.1015;0;INT([Calcoli.W43]/100))","v":20},null,"A",{"$f":"of:=IF([Calcoli.Z42]<1582.1015;0;INT([Calcoli.Z43]/100))","v":20},null,"A",{"$f":"of:=IF([Calcoli.AC42]<1582.1015;0;INT([Calcoli.AC43]/100))","v":20},null,"A",{"$f":"of:=IF([Calcoli.AF42]<1582.1015;0;INT([Calcoli.AF43]/100))","v":20},null,"A",{"$f":"of:=IF([Calcoli.AI42]<1582.1015;0;INT([Calcoli.AI43]/100))","v":20},null,"A",{"$f":"of:=IF([Calcoli.AL42]<1582.1015;0;INT([Calcoli.AL43]/100))","v":20},null,"A",{"$f":"of:=IF([Calcoli.AO42]<1582.1015;0;INT([Calcoli.AO43]/100))","v":20}]
["B",{"$f":"of:=IF([Calcoli.B42]<1582.1015;0;2-[Calcoli.B46]+INT([Calcoli.B46]/4))","v":-13},null,"B",{"$f":"of:=IF([Calcoli.E42]<1582.1015;0;2-[Calcoli.E46]+INT([Calcoli.E46]/4))","v":-13},null,"B",{"$f":"of:=IF([Calcoli.H42]<1582.1015;0;2-[Calcoli.H46]+INT([Calcoli.H46]/4))","v":-13},null,"B",{"$f":"of:=IF([Calcoli.K42]<1582.1015;0;2-[Calcoli.K46]+INT([Calcoli.K46]/4))","v":-13},null,"B",{"$f":"of:=IF([Calcoli.N42]<1582.1015;0;2-[Calcoli.N46]+INT([Calcoli.N46]/4))","v":-13},null,"B",{"$f":"of:=IF([Calcoli.Q42]<1582.1015;0;2-[Calcoli.Q46]+INT([Calcoli.Q46]/4))","v":-13},null,"B",{"$f":"of:=IF([Calcoli.T42]<1582.1015;0;2-[Calcoli.T46]+INT([Calcoli.T46]/4))","v":-13},null,"B",{"$f":"of:=IF([Calcoli.W42]<1582.1015;0;2-[Calcoli.W46]+INT([Calcoli.W46]/4))","v":-13},null,"B",{"$f":"of:=IF([Calcoli.Z42]<1582.1015;0;2-[Calcoli.Z46]+INT([Calcoli.Z46]/4))","v":-13},null,"B",{"$f":"of:=IF([Calcoli.AC42]<1582.1015;0;2-[Calcoli.AC46]+INT([Calcoli.AC46]/4))","v":-13},null,"B",{"$f":"of:=IF([Calcoli.AF42]<1582.1015;0;2-[Calcoli.AF46]+INT([Calcoli.AF46]/4))","v":-13},null,"B",{"$f":"of:=IF([Calcoli.AI42]<1582.1015;0;2-[Calcoli.AI46]+INT([Calcoli.AI46]/4))","v":-13},null,"B",{"$f":"of:=IF([Calcoli.AL42]<1582.1015;0;2-[Calcoli.AL46]+INT([Calcoli.AL46]/4))","v":-13},null,"B",{"$f":"of:=IF([Calcoli.AO42]<1582.1015;0;2-[Calcoli.AO46]+INT([Calcoli.AO46]/4))","v":-13}]
["Data_JD",{"$f":"of:=INT(365.25*([Calcoli.B43]+4716))+INT(30.6*([Calcoli.B44]+1))+[Calcoli.B45]+[Calcoli.B47]-1524.5","v":2452944.5},null,"Data_JD",{"$f":"of:=INT(365.25*([Calcoli.E43]+4716))+INT(30.6*([Calcoli.E44]+1))+[Calcoli.E45]+[Calcoli.E47]-1524.5","v":2452944.5},null,"Data_JD",{"$f":"of:=INT(365.25*([Calcoli.H43]+4716))+INT(30.6*([Calcoli.H44]+1))+[Calcoli.H45]+[Calcoli.H47]-1524.5","v":2452944.5},null,"Data_JD",{"$f":"of:=INT(365.25*([Calcoli.K43]+4716))+INT(30.6*([Calcoli.K44]+1))+[Calcoli.K45]+[Calcoli.K47]-1524.5","v":2452944.5},null,"Data_JD",{"$f":"of:=INT(365.25*([Calcoli.N43]+4716))+INT(30.6*([Calcoli.N44]+1))+[Calcoli.N45]+[Calcoli.N47]-1524.5","v":2452944.5},null,"Data_JD",{"$f":"of:=INT(365.25*([Calcoli.Q43]+4716))+INT(30.6*([Calcoli.Q44]+1))+[Calcoli.Q45]+[Calcoli.Q47]-1524.5","v":2452944.5},null,"Data_JD",{"$f":"of:=INT(365.25*([Calcoli.T43]+4716))+INT(30.6*([Calcoli.T44]+1))+[Calcoli.T45]+[Calcoli.T47]-1524.5","v":2452944.5},null,"Data_JD",{"$f":"of:=INT(365.25*([Calcoli.W43]+4716))+INT(30.6*([Calcoli.W44]+1))+[Calcoli.W45]+[Calcoli.W47]-1524.5","v":2452944.5},null,"Data_JD",{"$f":"of:=INT(365.25*([Calcoli.Z43]+4716))+INT(30.6*([Calcoli.Z44]+1))+[Calcoli.Z45]+[Calcoli.Z47]-1524.5","v":2452944.5},null,"Data_JD",{"$f":"of:=INT(365.25*([Calcoli.AC43]+4716))+INT(30.6*([Calcoli.AC44]+1))+[Calcoli.AC45]+[Calcoli.AC47]-1524.5","v":2452944.5},null,"Data_JD",{"$f":"of:=INT(365.25*([Calcoli.AF43]+4716))+INT(30.6*([Calcoli.AF44]+1))+[Calcoli.AF45]+[Calcoli.AF47]-1524.5","v":2452944.5},null,"Data_JD",{"$f":"of:=INT(365.25*([Calcoli.AI43]+4716))+INT(30.6*([Calcoli.AI44]+1))+[Calcoli.AI45]+[Calcoli.AI47]-1524.5","v":2452944.5},null,"Data_JD",{"$f":"of:=INT(365.25*([Calcoli.AL43]+4716))+INT(30.6*([Calcoli.AL44]+1))+[Calcoli.AL45]+[Calcoli.AL47]-1524.5","v":2452944.5},null,"Data_JD",{"$f":"of:=INT(365.25*([Calcoli.AO43]+4716))+INT(30.6*([Calcoli.AO44]+1))+[Calcoli.AO45]+[Calcoli.AO47]-1524.5","v":2452944.5}]
["JD_Data LN",{"$f":"of:=[Calcoli.B38]","v":2457722.0136},null,"JD_Data LN",{"$f":"of:=[Calcoli.E38]","v":2457751.7877},null,"JD_Data LN",{"$f":"of:=[Calcoli.H38]","v":2457781.5059},null,"JD_Data LN",{"$f":"of:=[Calcoli.K38]","v":2457811.1253},null,"JD_Data LN",{"$f":"of:=[Calcoli.N38]","v":2457840.6247},null,"JD_Data LN",{"$f":"of:=[Calcoli.Q38]","v":2457870.0128},null,"JD_Data LN",{"$f":"of:=[Calcoli.T38]","v":2457899.324},null,"JD_Data LN",{"$f":"of:=[Calcoli.W38]","v":2457928.6063},null,"JD_Data LN",{"$f":"of:=[Calcoli.Z38]","v":2457957.9082},null,"JD_Data LN",{"$f":"of:=[Calcoli.AC38]","v":2457987.2722},null,"JD_Data LN",{"$f":"of:=[Calcoli.AF38]","v":2458016.73},null,"JD_Data LN",{"$f":"of:=[Calcoli.AI38]","v":2458046.3008},null,"JD_Data LN",{"$f":"of:=[Calcoli.AL38]","v":2458075.9885},null,"JD_Data LN",{"$f":"of:=[Calcoli.AO38]","v":2458135.5965}]
["Z1",{"$f":"of:=INT([Calcoli.B49]+0.5)","v":2457722},null,"Z1",{"$f":"of:=INT([Calcoli.E49]+0.5)","v":2457752},null,"Z1",{"$f":"of:=INT([Calcoli.H49]+0.5)","v":2457782},null,"Z1",{"$f":"of:=INT([Calcoli.K49]+0.5)","v":2457811},null,"Z1",{"$f":"of:=INT([Calcoli.N49]+0.5)","v":2457841},null,"Z1",{"$f":"of:=INT([Calcoli.Q49]+0.5)","v":2457870},null,"Z1",{"$f":"of:=INT([Calcoli.T49]+0.5)","v":2457899},null,"Z1",{"$f":"of:=INT([Calcoli.W49]+0.5)","v":2457929},null,"Z1",{"$f":"of:=INT([Calcoli.Z49]+0.5)","v":2457958},null,"Z1",{"$f":"of:=INT([Calcoli.AC49]+0.5)","v":2457987},null,"Z1",{"$f":"of:=INT([Calcoli.AF49]+0.5)","v":2458017},null,"Z1",{"$f":"of:=INT([Calcoli.AI49]+0.5)","v":2458046},null,"Z1",{"$f":"of:=INT([Calcoli.AL49]+0.5)","v":2458076},null,"Z1",{"$f":"of:=INT([Calcoli.AO49]+0.5)","v":2458136}]
["F1",{"$f":"of:=[Calcoli.B49]+0.5-INT([Calcoli.B49]+0.5)","v":0.513600000180304},null,"F1",{"$f":"of:=[Calcoli.E49]+0.5-INT([Calcoli.E49]+0.5)","v":0.287700000219047},null,"F1",{"$f":"of:=[Calcoli.H49]+0.5-INT([Calcoli.H49]+0.5)","v":0.0059000002220273},null,"F1",{"$f":"of:=[Calcoli.K49]+0.5-INT([Calcoli.K49]+0.5)","v":0.625299999956042},null,"F1",{"$f":"of:=[Calcoli.N49]+0.5-INT([Calcoli.N49]+0.5)","v":0.124700000043958},null,"F1",{"$f":"of:=[Calcoli.Q49]+0.5-INT([Calcoli.Q49]+0.5)","v":0.512800000142306},null,"F1",{"$f":"of:=[Calcoli.T49]+0.5-INT([Calcoli.T49]+0.5)","v":0.824000000022352},null,"F1",{"$f":"of:=[Calcoli.W49]+0.5-INT([Calcoli.W49]+0.5)","v":0.106300000101328},null,"F1",{"$f":"of:=[Calcoli.Z49]+0.5-INT([Calcoli.Z49]+0.5)","v":0.408199999947101},null,"F1",{"$f":"of:=[Calcoli.AC49]+0.5-INT([Calcoli.AC49]+0.5)","v":0.772200000006706},null,"F1",{"$f":"of:=[Calcoli.AF49]+0.5-INT([Calcoli.AF49]+0.5)","v":0.229999999981374},null,"F1",{"$f":"of:=[Calcoli.AI49]+0.5-INT([Calcoli.AI49]+0.5)","v":0.800799999851733},null,"F1",{"$f":"of:=[Calcoli.AL49]+0.5-INT([Calcoli.AL49]+0.5)","v":0.488499999977648},null,"F1",{"$f":"of:=[Calcoli.AO49]+0.5-INT([Calcoli.AO49]+0.5)","v":0.0964999999850988}]
["Ω1",{"$f":"of:=INT(([Calcoli.B50]-1867216.25)/36524.25)","v":16},null,"Ω1",{"$f":"of:=INT(([Calcoli.E50]-1867216.25)/36524.25)","v":16},null,"Ω1",{"$f":"of:=INT(([Calcoli.H50]-1867216.25)/36524.25)","v":16},null,"Ω1",{"$f":"of:=INT(([Calcoli.K50]-1867216.25)/36524.25)","v":16},null,"Ω1",{"$f":"of:=INT(([Calcoli.N50]-1867216.25)/36524.25)","v":16},null,"Ω1",{"$f":"of:=INT(([Calcoli.Q50]-1867216.25)/36524.25)","v":16},null,"Ω1",{"$f":"of:=INT(([Calcoli.T50]-1867216.25)/36524.25)","v":16},null,"Ω1",{"$f":"of:=INT(([Calcoli.W50]-1867216.25)/36524.25)","v":16},null,"Ω1",{"$f":"of:=INT(([Calcoli.Z50]-1867216.25)/36524.25)","v":16},null,"Ω1",{"$f":"of:=INT(([Calcoli.AC50]-1867216.25)/36524.25)","v":16},null,"Ω1",{"$f":"of:=INT(([Calcoli.AF50]-1867216.25)/36524.25)","v":16},null,"Ω1",{"$f":"of:=INT(([Calcoli.AI50]-1867216.25)/36524.25)","v":16},null,"Ω1",{"$f":"of:=INT(([Calcoli.AL50]-1867216.25)/36524.25)","v":16},null,"Ω1",{"$f":"of:=INT(([Calcoli.AO50]-1867216.25)/36524.25)","v":16}]
["A1",{"$f":"of:=IF([Calcoli.B50]<2299161;[Calcoli.B50];[Calcoli.B50]+1+[Calcoli.B52]-INT([Calcoli.B52]/4))","v":2457735},null,"A1",{"$f":"of:=IF([Calcoli.E50]<2299161;[Calcoli.E50];[Calcoli.E50]+1+[Calcoli.E52]-INT([Calcoli.E52]/4))","v":2457765},null,"A1",{"$f":"of:=IF([Calcoli.H50]<2299161;[Calcoli.H50];[Calcoli.H50]+1+[Calcoli.H52]-INT([Calcoli.H52]/4))","v":2457795},null,"A1",{"$f":"of:=IF([Calcoli.K50]<2299161;[Calcoli.K50];[Calcoli.K50]+1+[Calcoli.K52]-INT([Calcoli.K52]/4))","v":2457824},null,"A1",{"$f":"of:=IF([Calcoli.N50]<2299161;[Calcoli.N50];[Calcoli.N50]+1+[Calcoli.N52]-INT([Calcoli.N52]/4))","v":2457854},null,"A1",{"$f":"of:=IF([Calcoli.Q50]<2299161;[Calcoli.Q50];[Calcoli.Q50]+1+[Calcoli.Q52]-INT([Calcoli.Q52]/4))","v":2457883},null,"A1",{"$f":"of:=IF([Calcoli.T50]<2299161;[Calcoli.T50];[Calcoli.T50]+1+[Calcoli.T52]-INT([Calcoli.T52]/4))","v":2457912},null,"A1",{"$f":"of:=IF([Calcoli.W50]<2299161;[Calcoli.W50];[Calcoli.W50]+1+[Calcoli.W52]-INT([Calcoli.W52]/4))","v":2457942},null,"A1",{"$f":"of:=IF([Calcoli.Z50]<2299161;[Calcoli.Z50];[Calcoli.Z50]+1+[Calcoli.Z52]-INT([Calcoli.Z52]/4))","v":2457971},null,"A1",{"$f":"of:=IF([Calcoli.AC50]<2299161;[Calcoli.AC50];[Calcoli.AC50]+1+[Calcoli.AC52]-INT([Calcoli.AC52]/4))","v":2458000},null,"A1",{"$f":"of:=IF([Calcoli.AF50]<2299161;[Calcoli.AF50];[Calcoli.AF50]+1+[Calcoli.AF52]-INT([Calcoli.AF52]/4))","v":2458030},null,"A1",{"$f":"of:=IF([Calcoli.AI50]<2299161;[Calcoli.AI50];[Calcoli.AI50]+1+[Calcoli.AI52]-INT([Calcoli.AI52]/4))","v":2458059},null,"A1",{"$f":"of:=IF([Calcoli.AL50]<2299161;[Calcoli.AL50];[Calcoli.AL50]+1+[Calcoli.AL52]-INT([Calcoli.AL52]/4))","v":2458089},null,"A1",{"$f":"of:=IF([Calcoli.AO50]<2299161;[Calcoli.AO50];[Calcoli.AO50]+1+[Calcoli.AO52]-INT([Calcoli.AO52]/4))","v":2458149}]
["B1",{"$f":"of:=[Calcoli.B53]+1524","v":2459259},null,"B1",{"$f":"of:=[Calcoli.E53]+1524","v":2459289},null,"B1",{"$f":"of:=[Calcoli.H53]+1524","v":2459319},null,"B1",{"$f":"of:=[Calcoli.K53]+1524","v":2459348},null,"B1",{"$f":"of:=[Calcoli.N53]+1524","v":2459378},null,"B1",{"$f":"of:=[Calcoli.Q53]+1524","v":2459407},null,"B1",{"$f":"of:=[Calcoli.T53]+1524","v":2459436},null,"B1",{"$f":"of:=[Calcoli.W53]+1524","v":2459466},null,"B1",{"$f":"of:=[Calcoli.Z53]+1524","v":2459495},null,"B1",{"$f":"of:=[Calcoli.AC53]+1524","v":2459524},null,"B1",{"$f":"of:=[Calcoli.AF53]+1524","v":2459554},null,"B1",{"$f":"of:=[Calcoli.AI53]+1524","v":2459583},null,"B1",{"$f":"of:=[Calcoli.AL53]+1524","v":2459613},null,"B1",{"$f":"of:=[Calcoli.AO53]+1524","v":2459673}]
["C1",{"$f":"of:=INT(([Calcoli.B54]-122.1)/365.25)","v":6732},null,"C1",{"$f":"of:=INT(([Calcoli.E54]-122.1)/365.25)","v":6732},null,"C1",{"$f":"of:=INT(([Calcoli.H54]-122.1)/365.25)","v":6732},null,"C1",{"$f":"of:=INT(([Calcoli.K54]-122.1)/365.25)","v":6732},null,"C1",{"$f":"of:=INT(([Calcoli.N54]-122.1)/365.25)","v":6733},null,"C1",{"$f":"of:=INT(([Calcoli.Q54]-122.1)/365.25)","v":6733},null,"C1",{"$f":"of:=INT(([Calcoli.T54]-122.1)/365.25)","v":6733},null,"C1",{"$f":"of:=INT(([Calcoli.W54]-122.1)/365.25)","v":6733},null,"C1",{"$f":"of:=INT(([Calcoli.Z54]-122.1)/365.25)","v":6733},null,"C1",{"$f":"of:=INT(([Calcoli.AC54]-122.1)/365.25)","v":6733},null,"C1",{"$f":"of:=INT(([Calcoli.AF54]-122.1)/365.25)","v":6733},null,"C1",{"$f":"of:=INT(([Calcoli.AI54]-122.1)/365.25)","v":6733},null,"C1",{"$f":"of:=INT(([Calcoli.AL54]-122.1)/365.25)","v":6733},null,"C1",{"$f":"of:=INT(([Calcoli.AO54]-122.1)/365.25)","v":6733}]
["D1",{"$f":"of:=INT(365.25*[Calcoli.B55])","v":2458863},null,"D1",{"$f":"of:=INT(365.25*[Calcoli.E55])","v":2458863},null,"D1",{"$f":"of:=INT(365.25*[Calcoli.H55])","v":2458863},null,"D1",{"$f":"of:=INT(365.25*[Calcoli.K55])","v":2458863},null,"D1",{"$f":"of:=INT(365.25*[Calcoli.N55])","v":2459228},null,"D1",{"$f":"of:=INT(365.25*[Calcoli.Q55])","v":2459228},null,"D1",{"$f":"of:=INT(365.25*[Calcoli.T55])","v":2459228},null,"D1",{"$f":"of:=INT(365.25*[Calcoli.W55])","v":2459228},null,"D1",{"$f":"of:=INT(365.25*[Calcoli.Z55])","v":2459228},null,"D1",{"$f":"of:=INT(365.25*[Calcoli.AC55])","v":2459228},null,"D1",{"$f":"of:=INT(365.25*[Calcoli.AF55])","v":2459228},null,"D1",{"$f":"of:=INT(365.25*[Calcoli.AI55])","v":2459228},null,"D1",{"$f":"of:=INT(365.25*[Calcoli.AL55])","v":2459228},null,"D1",{"$f":"of:=INT(365.25*[Calcoli.AO55])","v":2459228}]
["E1",{"$f":"of:=INT(([Calcoli.B54]-[Calcoli.B56])/30.6001)","v":12},null,"E1",{"$f":"of:=INT(([Calcoli.E54]-[Calcoli.E56])/30.6001)","v":13},null,"E1",{"$f":"of:=INT(([Calcoli.H54]-[Calcoli.H56])/30.6001)","v":14},null,"E1",{"$f":"of:=INT(([Calcoli.K54]-[Calcoli.K56])/30.6001)","v":15},null,"E1",{"$f":"of:=INT(([Calcoli.N54]-[Calcoli.N56])/30.6001)","v":4},null,"E1",{"$f":"of:=INT(([Calcoli.Q54]-[Calcoli.Q56])/30.6001)","v":5},null,"E1",{"$f":"of:=INT(([Calcoli.T54]-[Calcoli.T56])/30.6001)","v":6},null,"E1",{"$f":"of:=INT(([Calcoli.W54]-[Calcoli.W56])/30.6001)","v":7},null,"E1",{"$f":"of:=INT(([Calcoli.Z54]-[Calcoli.Z56])/30.6001)","v":8},null,"E1",{"$f":"of:=INT(([Calcoli.AC54]-[Calcoli.AC56])/30.6001)","v":9},null,"E1",{"$f":"of:=INT(([Calcoli.AF54]-[Calcoli.AF56])/30.6001)","v":10},null,"E1",{"$f":"of:=INT(([Calcoli.AI54]-[Calcoli.AI56])/30.6001)","v":11},null,"E1",{"$f":"of:=INT(([Calcoli.AL54]-[Calcoli.AL56])/30.6001)","v":12},null,"E1",{"$f":"of:=INT(([Calcoli.AO54]-[Calcoli.AO56])/30.6001)","v":14}]
["Giorno_LN",{"$f":"of:=ROUND([Calcoli.B54]-[Calcoli.B56]-INT(30.6001*[Calcoli.B57])+[Calcoli.B51];4)","v":29.5136},null,"Giorno_LN",{"$f":"of:=ROUND([Calcoli.E54]-[Calcoli.E56]-INT(30.6001*[Calcoli.E57])+[Calcoli.E51];4)","v":29.2877},null,"Giorno_LN",{"$f":"of:=ROUND([Calcoli.H54]-[Calcoli.H56]-INT(30.6001*[Calcoli.H57])+[Calcoli.H51];4)","v":28.0059},null,"Giorno_LN",{"$f":"of:=ROUND([Calcoli.K54]-[Calcoli.K56]-INT(30.6001*[Calcoli.K57])+[Calcoli.K51];4)","v":26.6253},null,"Giorno_LN",{"$f":"of:=ROUND([Calcoli.N54]-[Calcoli.N56]-INT(30.6001*[Calcoli.N57])+[Calcoli.N51];4)","v":28.1247},null,"Giorno_LN",{"$f":"of:=ROUND([Calcoli.Q54]-[Calcoli.Q56]-INT(30.6001*[Calcoli.Q57])+[Calcoli.Q51];4)","v":26.5128},null,"Giorno_LN",{"$f":"of:=ROUND([Calcoli.T54]-[Calcoli.T56]-INT(30.6001*[Calcoli.T57])+[Calcoli.T51];4)","v":25.824},null,"Giorno_LN",{"$f":"of:=ROUND([Calcoli.W54]-[Calcoli.W56]-INT(30.6001*[Calcoli.W57])+[Calcoli.W51];4)","v":24.1063},null,"Giorno_LN",{"$f":"of:=ROUND([Calcoli.Z54]-[Calcoli.Z56]-INT(30.6001*[Calcoli.Z57])+[Calcoli.Z51];4)","v":23.4082},null,"Giorno_LN",{"$f":"of:=ROUND([Calcoli.AC54]-[Calcoli.AC56]-INT(30.6001*[Calcoli.AC57])+[Calcoli.AC51];4)","v":21.7722},null,"Giorno_LN",{"$f":"of:=ROUND([Calcoli.AF54]-[Calcoli.AF56]-INT(30.6001*[Calcoli.AF57])+[Calcoli.AF51];4)","v":20.23},null,"Giorno_LN",{"$f":"of:=ROUND([Calcoli.AI54]-[Calcoli.AI56]-INT(30.6001*[Calcoli.AI57])+[Calcoli.AI51];4)","v":19.8008},null,"Giorno_LN",{"$f":"of:=ROUND([Calcoli.AL54]-[Calcoli.AL56]-INT(30.6001*[Calcoli.AL57])+[Calcoli.AL51];4)","v":18.4885},null,"Giorno_LN",{"$f":"of:=ROUND([Calcoli.AO54]-[Calcoli.AO56]-INT(30.6001*[Calcoli.AO57])+[Calcoli.AO51];4)","v":17.0965}]
["Mese_LN",{"$f":"of:=IF([Calcoli.B57]<13.5;[Calcoli.B57]-1;[Calcoli.B57]-13)","v":11},null,"Mese_LN",{"$f":"of:=IF([Calcoli.E57]<13.5;[Calcoli.E57]-1;[Calcoli.E57]-13)","v":12},null,"Mese_LN",{"$f":"of:=IF([Calcoli.H57]<13.5;[Calcoli.H57]-1;[Calcoli.H57]-13)","v":1},null,"Mese_LN",{"$f":"of:=IF([Calcoli.K57]<13.5;[Calcoli.K57]-1;[Calcoli.K57]-13)","v":2},null,"Mese_LN",{"$f":"of:=IF([Calcoli.N57]<13.5;[Calcoli.N57]-1;[Calcoli.N57]-13)","v":3},null,"Mese_LN",{"$f":"of:=IF([Calcoli.Q57]<13.5;[Calcoli.Q57]-1;[Calcoli.Q57]-13)","v":4},null,"Mese_LN",{"$f":"of:=IF([Calcoli.T57]<13.5;[Calcoli.T57]-1;[Calcoli.T57]-13)","v":5},null,"Mese_LN",{"$f":"of:=IF([Calcoli.W57]<13.5;[Calcoli.W57]-1;[Calcoli.W57]-13)","v":6},null,"Mese_LN",{"$f":"of:=IF([Calcoli.Z57]<13.5;[Calcoli.Z57]-1;[Calcoli.Z57]-13)","v":7},null,"Mese_LN",{"$f":"of:=IF([Calcoli.AC57]<13.5;[Calcoli.AC57]-1;[Calcoli.AC57]-13)","v":8},null,"Mese_LN",{"$f":"of:=IF([Calcoli.AF57]<13.5;[Calcoli.AF57]-1;[Calcoli.AF57]-13)","v":9},null,"Mese_LN",{"$f":"of:=IF([Calcoli.AI57]<13.5;[Calcoli.AI57]-1;[Calcoli.AI57]-13)","v":10},null,"Mese_LN",{"$f":"of:=IF([Calcoli.AL57]<13.5;[Calcoli.AL57]-1;[Calcoli.AL57]-13)","v":11},null,"Mese_LN",{"$f":"of:=IF([Calcoli.AO57]<13.5;[Calcoli.AO57]-1;[Calcoli.AO57]-13)","v":1}]
["ANNO_LN",{"$f":"of:=IF([Calcoli.B59]>2.5 AND([Calcoli.B59]<12.5);[Calcoli.B55]-4716;[Calcoli.B55]-4715)","v":2016},null,"ANNO_LN",{"$f":"of:=IF([Calcoli.E59]>2.5 AND([Calcoli.E59]<12.5);[Calcoli.E55]-4716;[Calcoli.E55]-4715)","v":2016},null,"ANNO_LN",{"$f":"of:=IF([Calcoli.H59]>2.5 AND([Calcoli.H59]<12.5);[Calcoli.H55]-4716;[Calcoli.H55]-4715)","v":2017},null,"ANNO_LN",{"$f":"of:=IF([Calcoli.K59]>2.5 AND([Calcoli.K59]<12.5);[Calcoli.K55]-4716;[Calcoli.K55]-4715)","v":2017},null,"ANNO_LN",{"$f":"of:=IF([Calcoli.N59]>2.5 AND([Calcoli.N59]<12.5);[Calcoli.N55]-4716;[Calcoli.N55]-4715)","v":2017},null,"ANNO_LN",{"$f":"of:=IF([Calcoli.Q59]>2.5 AND([Calcoli.Q59]<12.5);[Calcoli.Q55]-4716;[Calcoli.Q55]-4715)","v":2017},null,"ANNO_LN",{"$f":"of:=IF([Calcoli.T59]>2.5 AND([Calcoli.T59]<12.5);[Calcoli.T55]-4716;[Calcoli.T55]-4715)","v":2017},null,"ANNO_LN",{"$f":"of:=IF([Calcoli.W59]>2.5 AND([Calcoli.W59]<12.5);[Calcoli.W55]-4716;[Calcoli.W55]-4715)","v":2017},null,"ANNO_LN",{"$f":"of:=IF([Calcoli.Z59]>2.5 AND([Calcoli.Z59]<12.5);[Calcoli.Z55]-4716;[Calcoli.Z55]-4715)","v":2017},null,"ANNO_LN",{"$f":"of:=IF([Calcoli.AC59]>2.5 AND([Calcoli.AC59]<12.5);[Calcoli.AC55]-4716;[Calcoli.AC55]-4715)","v":2017},null,"ANNO_LN",{"$f":"of:=IF([Calcoli.AF59]>2.5 AND([Calcoli.AF59]<12.5);[Calcoli.AF55]-4716;[Calcoli.AF55]-4715)","v":2017},null,"ANNO_LN",{"$f":"of:=IF([Calcoli.AI59]>2.5 AND([Calcoli.AI59]<12.5);[Calcoli.AI55]-4716;[Calcoli.AI55]-4715)","v":2017},null,"ANNO_LN",{"$f":"of:=IF([Calcoli.AL59]>2.5 AND([Calcoli.AL59]<12.5);[Calcoli.AL55]-4716;[Calcoli.AL55]-4715)","v":2017},null,"ANNO_LN",{"$f":"of:=IF([Calcoli.AO59]>2.5 AND([Calcoli.AO59]<12.5);[Calcoli.AO55]-4716;[Calcoli.AO55]-4715)","v":2018}]
["Data_GD LN",{"$f":"of:=DATE([Calcoli.B60];[Calcoli.B59];[Calcoli.B58])","v":"2016-11-29"},null,"Data_GD LN",{"$f":"of:=DATE([Calcoli.E60];[Calcoli.E59];[Calcoli.E58])","v":"2016-12-29"},null,"Data_GD LN",{"$f":"of:=DATE([Calcoli.H60];[Calcoli.H59];[Calcoli.H58])","v":"2017-01-28"},null,"Data_GD LN",{"$f":"of:=DATE([Calcoli.K60];[Calcoli.K59];[Calcoli.K58])","v":"2017-02-26"},null,"Data_GD LN",{"$f":"of:=DATE([Calcoli.N60];[Calcoli.N59];[Calcoli.N58])","v":"2017-03-28"},null,"Data_GD LN",{"$f":"of:=DATE([Calcoli.Q60];[Calcoli.Q59];[Calcoli.Q58])","v":"2017-04-26"},null,"Data_GD LN",{"$f":"of:=DATE([Calcoli.T60];[Calcoli.T59];[Calcoli.T58])","v":"2017-05-25"},null,"Data_GD LN",{"$f":"of:=DATE([Calcoli.W60];[Calcoli.W59];[Calcoli.W58])","v":"2017-06-24"},null,"Data_GD LN",{"$f":"of:=DATE([Calcoli.Z60];[Calcoli.Z59];[Calcoli.Z58])","v":"2017-07-23"},null,"Data_GD LN",{"$f":"of:=DATE([Calcoli.AC60];[Calcoli.AC59];[Calcoli.AC58])","v":"2017-08-21"},null,"Data_GD LN",{"$f":"of:=DATE([Calcoli.AF60];[Calcoli.AF59];[Calcoli.AF58])","v":"2017-09-20"},null,"Data_GD LN",{"$f":"of:=DATE([Calcoli.AI60];[Calcoli.AI59];[Calcoli.AI58])","v":"2017-10-19"},null,"Data_GD LN",{"$f":"of:=DATE([Calcoli.AL60];[Calcoli.AL59];[Calcoli.AL58])","v":"2017-11-18"},null,"Data_GD LN",{"$f":"of:=DATE([Calcoli.AO60];[Calcoli.AO59];[Calcoli.AO58])","v":"2018-01-17"}]
["Ore_GD LN",{"$f":"of:=INT(([Calcoli.B58]-INT([Calcoli.B58]))*24)+1","v":13},null,"Ore_GD LN",{"$f":"of:=INT(([Calcoli.E58]-INT([Calcoli.E58]))*24)+1","v":7},null,"Ore_GD LN",{"$f":"of:=INT(([Calcoli.H58]-INT([Calcoli.H58]))*24)+1","v":1},null,"Ore_GD LN",{"$f":"of:=INT(([Calcoli.K58]-INT([Calcoli.K58]))*24)+1","v":16},null,"Ore_GD LN",{"$f":"of:=INT(([Calcoli.N58]-INT([Calcoli.N58]))*24)+1","v":3},null,"Ore_GD LN",{"$f":"of:=INT(([Calcoli.Q58]-INT([Calcoli.Q58]))*24)+1","v":13},null,"Ore_GD LN",{"$f":"of:=INT(([Calcoli.T58]-INT([Calcoli.T58]))*24)+1","v":20},null,"Ore_GD LN",{"$f":"of:=INT(([Calcoli.W58]-INT([Calcoli.W58]))*24)+1","v":3},null,"Ore_GD LN",{"$f":"of:=INT(([Calcoli.Z58]-INT([Calcoli.Z58]))*24)+1","v":10},null,"Ore_GD LN",{"$f":"of:=INT(([Calcoli.AC58]-INT([Calcoli.AC58]))*24)+1","v":19},null,"Ore_GD LN",{"$f":"of:=INT(([Calcoli.AF58]-INT([Calcoli.AF58]))*24)+1","v":6},null,"Ore_GD LN",{"$f":"of:=INT(([Calcoli.AI58]-INT([Calcoli.AI58]))*24)+1","v":20},null,"Ore_GD LN",{"$f":"of:=INT(([Calcoli.AL58]-INT([Calcoli.AL58]))*24)+1","v":12},null,"Ore_GD LN",{"$f":"of:=INT(([Calcoli.AO58]-INT([Calcoli.AO58]))*24)+1","v":3}]
["Minuti_GD LN",{"$f":"of:=INT((([Calcoli.B58]-INT([Calcoli.B58]))*24-([Calcoli.B62]-1))*60)","v":19},null,"Minuti_GD LN",{"$f":"of:=INT((([Calcoli.E58]-INT([Calcoli.E58]))*24-([Calcoli.E62]-1))*60)","v":54},null,"Minuti_GD LN",{"$f":"of:=INT((([Calcoli.H58]-INT([Calcoli.H58]))*24-([Calcoli.H62]-1))*60)","v":8},null,"Minuti_GD LN",{"$f":"of:=INT((([Calcoli.K58]-INT([Calcoli.K58]))*24-([Calcoli.K62]-1))*60)","v":0},null,"Minuti_GD LN",{"$f":"of:=INT((([Calcoli.N58]-INT([Calcoli.N58]))*24-([Calcoli.N62]-1))*60)","v":59},null,"Minuti_GD LN",{"$f":"of:=INT((([Calcoli.Q58]-INT([Calcoli.Q58]))*24-([Calcoli.Q62]-1))*60)","v":18},null,"Minuti_GD LN",{"$f":"of:=INT((([Calcoli.T58]-INT([Calcoli.T58]))*24-([Calcoli.T62]-1))*60)","v":46},null,"Minuti_GD LN",{"$f":"of:=INT((([Calcoli.W58]-INT([Calcoli.W58]))*24-([Calcoli.W62]-1))*60)","v":33},null,"Minuti_GD LN",{"$f":"of:=INT((([Calcoli.Z58]-INT([Calcoli.Z58]))*24-([Calcoli.Z62]-1))*60)","v":47},null,"Minuti_GD LN",{"$f":"of:=INT((([Calcoli.AC58]-INT([Calcoli.AC58]))*24-([Calcoli.AC62]-1))*60)","v":31},null,"Minuti_GD LN",{"$f":"of:=INT((([Calcoli.AF58]-INT([Calcoli.AF58]))*24-([Calcoli.AF62]-1))*60)","v":31},null,"Minuti_GD LN",{"$f":"of:=INT((([Calcoli.AI58]-INT([Calcoli.AI58]))*24-([Calcoli.AI62]-1))*60)","v":13},null,"Minuti_GD LN",{"$f":"of:=INT((([Calcoli.AL58]-INT([Calcoli.AL58]))*24-([Calcoli.AL62]-1))*60)","v":43},null,"Minuti_GD LN",{"$f":"of:=INT((([Calcoli.AO58]-INT([Calcoli.AO58]))*24-([Calcoli.AO62]-1))*60)","v":18}]
["Secondi_GD LN",{"$f":"of:=INT((((([Calcoli.B58]-INT([Calcoli.B58]))*24-([Calcoli.B62]-1))*60)-[Calcoli.B63])*60)","v":35},null,"Secondi_GD LN",{"$f":"of:=INT((((([Calcoli.E58]-INT([Calcoli.E58]))*24-([Calcoli.E62]-1))*60)-[Calcoli.E63])*60)","v":17},null,"Secondi_GD LN",{"$f":"of:=INT((((([Calcoli.H58]-INT([Calcoli.H58]))*24-([Calcoli.H62]-1))*60)-[Calcoli.H63])*60)-120","v":-91},null,"Secondi_GD LN",{"$f":"of:=INT((((([Calcoli.K58]-INT([Calcoli.K58]))*24-([Calcoli.K62]-1))*60)-[Calcoli.K63])*60)-60","v":-35},null,"Secondi_GD LN",{"$f":"of:=INT((((([Calcoli.N58]-INT([Calcoli.N58]))*24-([Calcoli.N62]-1))*60)-[Calcoli.N63])*60)","v":34},null,"Secondi_GD LN",{"$f":"of:=INT((((([Calcoli.Q58]-INT([Calcoli.Q58]))*24-([Calcoli.Q62]-1))*60)-[Calcoli.Q63])*60)","v":25},null,"Secondi_GD LN",{"$f":"of:=INT((((([Calcoli.T58]-INT([Calcoli.T58]))*24-([Calcoli.T62]-1))*60)-[Calcoli.T63])*60)","v":33},null,"Secondi_GD LN",{"$f":"of:=INT((((([Calcoli.W58]-INT([Calcoli.W58]))*24-([Calcoli.W62]-1))*60)-[Calcoli.W63])*60)","v":4},null,"Secondi_GD LN",{"$f":"of:=INT((((([Calcoli.Z58]-INT([Calcoli.Z58]))*24-([Calcoli.Z62]-1))*60)-[Calcoli.Z63])*60)","v":48},null,"Secondi_GD LN",{"$f":"of:=INT((((([Calcoli.AC58]-INT([Calcoli.AC58]))*24-([Calcoli.AC62]-1))*60)-[Calcoli.AC63])*60)","v":58},null,"Secondi_GD LN",{"$f":"of:=INT((((([Calcoli.AF58]-INT([Calcoli.AF58]))*24-([Calcoli.AF62]-1))*60)-[Calcoli.AF63])*60)","v":12},null,"Secondi_GD LN",{"$f":"of:=INT((((([Calcoli.AI58]-INT([Calcoli.AI58]))*24-([Calcoli.AI62]-1))*60)-[Calcoli.AI63])*60)","v":9},null,"Secondi_GD LN",{"$f":"of:=INT((((([Calcoli.AL58]-INT([Calcoli.AL58]))*24-([Calcoli.AL62]-1))*60)-[Calcoli.AL63])*60)","v":26},null,"Secondi_GD LN",{"$f":"of:=INT((((([Calcoli.AO58]-INT([Calcoli.AO58]))*24-([Calcoli.AO62]-1))*60)-[Calcoli.AO63])*60)","v":57}]
["JD_Data PQ",{"$f":"of:=[Calcoli.B39]","v":2457729.8752},null,"JD_Data PQ",{"$f":"of:=[Calcoli.E39]","v":2457759.3222},null,"JD_Data PQ",{"$f":"of:=[Calcoli.H39]","v":2457788.6777},null,"JD_Data PQ",{"$f":"of:=[Calcoli.K39]","v":2457817.9789},null,"JD_Data PQ",{"$f":"of:=[Calcoli.N39]","v":2457847.2756},null,"JD_Data PQ",{"$f":"of:=[Calcoli.Q39]","v":2457876.6139},null,"JD_Data PQ",{"$f":"of:=[Calcoli.T39]","v":2457906.0269},null,"JD_Data PQ",{"$f":"of:=[Calcoli.W39]","v":2457935.5331},null,"JD_Data PQ",{"$f":"of:=[Calcoli.Z39]","v":2457965.1389},null,"JD_Data PQ",{"$f":"of:=[Calcoli.AC39]","v":2457994.8409},null,"JD_Data PQ",{"$f":"of:=[Calcoli.AF39]","v":2458024.6194},null,"JD_Data PQ",{"$f":"of:=[Calcoli.AI39]","v":2458054.4308},null,"JD_Data PQ",{"$f":"of:=[Calcoli.AL39]","v":2458084.2088},null,"JD_Data PQ",{"$f":"of:=[Calcoli.AO39]","v":2458143.4289}]
["Z2",{"$f":"of:=INT([Calcoli.B65]+0.5)","v":2457730},null,"Z2",{"$f":"of:=INT([Calcoli.E65]+0.5)","v":2457759},null,"Z2",{"$f":"of:=INT([Calcoli.H65]+0.5)","v":2457789},null,"Z2",{"$f":"of:=INT([Calcoli.K65]+0.5)","v":2457818},null,"Z2",{"$f":"of:=INT([Calcoli.N65]+0.5)","v":2457847},null,"Z2",{"$f":"of:=INT([Calcoli.Q65]+0.5)","v":2457877},null,"Z2",{"$f":"of:=INT([Calcoli.T65]+0.5)","v":2457906},null,"Z2",{"$f":"of:=INT([Calcoli.W65]+0.5)","v":2457936},null,"Z2",{"$f":"of:=INT([Calcoli.Z65]+0.5)","v":2457965},null,"Z2",{"$f":"of:=INT([Calcoli.AC65]+0.5)","v":2457995},null,"Z2",{"$f":"of:=INT([Calcoli.AF65]+0.5)","v":2458025},null,"Z2",{"$f":"of:=INT([Calcoli.AI65]+0.5)","v":2458054},null,"Z2",{"$f":"of:=INT([Calcoli.AL65]+0.5)","v":2458084},null,"Z2",{"$f":"of:=INT([Calcoli.AO65]+0.5)","v":2458143}]
["F2",{"$f":"of:=[Calcoli.B65]+0.5-INT([Calcoli.B65]+0.5)","v":0.375200000125915},null,"F2",{"$f":"of:=[Calcoli.E65]+0.5-INT([Calcoli.E65]+0.5)","v":0.822199999820441},null,"F2",{"$f":"of:=[Calcoli.H65]+0.5-INT([Calcoli.H65]+0.5)","v":0.177699999883771},null,"F2",{"$f":"of:=[Calcoli.K65]+0.5-INT([Calcoli.K65]+0.5)","v":0.478899999987334},null,"F2",{"$f":"of:=[Calcoli.N65]+0.5-INT([Calcoli.N65]+0.5)","v":0.775599999818951},null,"F2",{"$f":"of:=[Calcoli.Q65]+0.5-INT([Calcoli.Q65]+0.5)","v":0.113900000229478},null,"F2",{"$f":"of:=[Calcoli.T65]+0.5-INT([Calcoli.T65]+0.5)","v":0.526899999938905},null,"F2",{"$f":"of:=[Calcoli.W65]+0.5-INT([Calcoli.W65]+0.5)","v":0.0331000001169741},null,"F2",{"$f":"of:=[Calcoli.Z65]+0.5-INT([Calcoli.Z65]+0.5)","v":0.638900000136346},null,"F2",{"$f":"of:=[Calcoli.AC65]+0.5-INT([Calcoli.AC65]+0.5)","v":0.340900000184774},null,"F2",{"$f":"of:=[Calcoli.AF65]+0.5-INT([Calcoli.AF65]+0.5)","v":0.119400000199676},null,"F2",{"$f":"of:=[Calcoli.AI65]+0.5-INT([Calcoli.AI65]+0.5)","v":0.930800000205636},null,"F2",{"$f":"of:=[Calcoli.AL65]+0.5-INT([Calcoli.AL65]+0.5)","v":0.708800000138581},null,"F2",{"$f":"of:=[Calcoli.AO65]+0.5-INT([Calcoli.AO65]+0.5)","v":0.928900000173599}]
["Ω2",{"$f":"of:=INT(([Calcoli.B66]-1867216.25)/36524.25)","v":16},null,"Ω2",{"$f":"of:=INT(([Calcoli.E66]-1867216.25)/36524.25)","v":16},null,"Ω2",{"$f":"of:=INT(([Calcoli.H66]-1867216.25)/36524.25)","v":16},null,"Ω2",{"$f":"of:=INT(([Calcoli.K66]-1867216.25)/36524.25)","v":16},null,"Ω2",{"$f":"of:=INT(([Calcoli.N66]-1867216.25)/36524.25)","v":16},null,"Ω2",{"$f":"of:=INT(([Calcoli.Q66]-1867216.25)/36524.25)","v":16},null,"Ω2",{"$f":"of:=INT(([Calcoli.T66]-1867216.25)/36524.25)","v":16},null,"Ω2",{"$f":"of:=INT(([Calcoli.W66]-1867216.25)/36524.25)","v":16},null,"Ω2",{"$f":"of:=INT(([Calcoli.Z66]-1867216.25)/36524.25)","v":16},null,"Ω2",{"$f":"of:=INT(([Calcoli.AC66]-1867216.25)/36524.25)","v":16},null,"Ω2",{"$f":"of:=INT(([Calcoli.AF66]-1867216.25)/36524.25)","v":16},null,"Ω2",{"$f":"of:=INT(([Calcoli.AI66]-1867216.25)/36524.25)","v":16},null,"Ω2",{"$f":"of:=INT(([Calcoli.AL66]-1867216.25)/36524.25)","v":16},null,"Ω2",{"$f":"of:=INT(([Calcoli.AO66]-1867216.25)/36524.25)","v":16}]
["A2",{"$f":"of:=IF([Calcoli.B66]<2299161;[Calcoli.B66];[Calcoli.B66]+1+[Calcoli.B68]-INT([Calcoli.B68]/4))","v":2457743},null,"A2",{"$f":"of:=IF([Calcoli.E66]<2299161;[Calcoli.E66];[Calcoli.E66]+1+[Calcoli.E68]-INT([Calcoli.E68]/4))","v":2457772},null,"A2",{"$f":"of:=IF([Calcoli.H66]<2299161;[Calcoli.H66];[Calcoli.H66]+1+[Calcoli.H68]-INT([Calcoli.H68]/4))","v":2457802},null,"A2",{"$f":"of:=IF([Calcoli.K66]<2299161;[Calcoli.K66];[Calcoli.K66]+1+[Calcoli.K68]-INT([Calcoli.K68]/4))","v":2457831},null,"A2",{"$f":"of:=IF([Calcoli.N66]<2299161;[Calcoli.N66];[Calcoli.N66]+1+[Calcoli.N68]-INT([Calcoli.N68]/4))","v":2457860},null,"A2",{"$f":"of:=IF([Calcoli.Q66]<2299161;[Calcoli.Q66];[Calcoli.Q66]+1+[Calcoli.Q68]-INT([Calcoli.Q68]/4))","v":2457890},null,"A2",{"$f":"of:=IF([Calcoli.T66]<2299161;[Calcoli.T66];[Calcoli.T66]+1+[Calcoli.T68]-INT([Calcoli.T68]/4))","v":2457919},null,"A2",{"$f":"of:=IF([Calcoli.W66]<2299161;[Calcoli.W66];[Calcoli.W66]+1+[Calcoli.W68]-INT([Calcoli.W68]/4))","v":2457949},null,"A2",{"$f":"of:=IF([Calcoli.Z66]<2299161;[Calcoli.Z66];[Calcoli.Z66]+1+[Calcoli.Z68]-INT([Calcoli.Z68]/4))","v":2457978},null,"A2",{"$f":"of:=IF([Calcoli.AC66]<2299161;[Calcoli.AC66];[Calcoli.AC66]+1+[Calcoli.AC68]-INT([Calcoli.AC68]/4))","v":2458008},null,"A2",{"$f":"of:=IF([Calcoli.AF66]<2299161;[Calcoli.AF66];[Calcoli.AF66]+1+[Calcoli.AF68]-INT([Calcoli.AF68]/4))","v":2458038},null,"A2",{"$f":"of:=IF([Calcoli.AI66]<2299161;[Calcoli.AI66];[Calcoli.AI66]+1+[Calcoli.AI68]-INT([Calcoli.AI68]/4))","v":2458067},null,"A2",{"$f":"of:=IF([Calcoli.AL66]<2299161;[Calcoli.AL66];[Calcoli.AL66]+1+[Calcoli.AL68]-INT([Calcoli.AL68]/4))","v":2458097},null,"A2",{"$f":"of:=IF([Calcoli.AO66]<2299161;[Calcoli.AO66];[Calcoli.AO66]+1+[Calcoli.AO68]-INT([Calcoli.AO68]/4))","v":2458156}]
["B2",{"$f":"of:=[Calcoli.B69]+1524","v":2459267},null,"B2",{"$f":"of:=[Calcoli.E69]+1524","v":2459296},null,"B2",{"$f":"of:=[Calcoli.H69]+1524","v":2459326},null,"B2",{"$f":"of:=[Calcoli.K69]+1524","v":2459355},null,"B2",{"$f":"of:=[Calcoli.N69]+1524","v":2459384},null,"B2",{"$f":"of:=[Calcoli.Q69]+1524","v":2459414},null,"B2",{"$f":"of:=[Calcoli.T69]+1524","v":2459443},null,"B2",{"$f":"of:=[Calcoli.W69]+1524","v":2459473},null,"B2",{"$f":"of:=[Calcoli.Z69]+1524","v":2459502},null,"B2",{"$f":"of:=[Calcoli.AC69]+1524","v":2459532},null,"B2",{"$f":"of:=[Calcoli.AF69]+1524","v":2459562},null,"B2",{"$f":"of:=[Calcoli.AI69]+1524","v":2459591},null,"B2",{"$f":"of:=[Calcoli.AL69]+1524","v":2459621},null,"B2",{"$f":"of:=[Calcoli.AO69]+1524","v":2459680}]
["C2",{"$f":"of:=INT(([Calcoli.B70]-122.1)/365.25)","v":6732},null,"C2",{"$f":"of:=INT(([Calcoli.E70]-122.1)/365.25)","v":6732},null,"C2",{"$f":"of:=INT(([Calcoli.H70]-122.1)/365.25)","v":6732},null,"C2",{"$f":"of:=INT(([Calcoli.K70]-122.1)/365.25)","v":6733},null,"C2",{"$f":"of:=INT(([Calcoli.N70]-122.1)/365.25)","v":6733},null,"C2",{"$f":"of:=INT(([Calcoli.Q70]-122.1)/365.25)","v":6733},null,"C2",{"$f":"of:=INT(([Calcoli.T70]-122.1)/365.25)","v":6733},null,"C2",{"$f":"of:=INT(([Calcoli.W70]-122.1)/365.25)","v":6733},null,"C2",{"$f":"of:=INT(([Calcoli.Z70]-122.1)/365.25)","v":6733},null,"C2",{"$f":"of:=INT(([Calcoli.AC70]-122.1)/365.25)","v":6733},null,"C2",{"$f":"of:=INT(([Calcoli.AF70]-122.1)/365.25)","v":6733},null,"C2",{"$f":"of:=INT(([Calcoli.AI70]-122.1)/365.25)","v":6733},null,"C2",{"$f":"of:=INT(([Calcoli.AL70]-122.1)/365.25)","v":6733},null,"C2",{"$f":"of:=INT(([Calcoli.AO70]-122.1)/365.25)","v":6733}]
["D2",{"$f":"of:=INT(365.25*[Calcoli.B71])","v":2458863},null,"D2",{"$f":"of:=INT(365.25*[Calcoli.E71])","v":2458863},null,"D2",{"$f":"of:=INT(365.25*[Calcoli.H71])","v":2458863},null,"D2",{"$f":"of:=INT(365.25*[Calcoli.K71])","v":2459228},null,"D2",{"$f":"of:=INT(365.25*[Calcoli.N71])","v":2459228},null,"D2",{"$f":"of:=INT(365.25*[Calcoli.Q71])","v":2459228},null,"D2",{"$f":"of:=INT(365.25*[Calcoli.T71])","v":2459228},null,"D2",{"$f":"of:=INT(365.25*[Calcoli.W71])","v":2459228},null,"D2",{"$f":"of:=INT(365.25*[Calcoli.Z71])","v":2459228},null,"D2",{"$f":"of:=INT(365.25*[Calcoli.AC71])","v":2459228},null,"D2",{"$f":"of:=INT(365.25*[Calcoli.AF71])","v":2459228},null,"D2",{"$f":"of:=INT(365.25*[Calcoli.AI71])","v":2459228},null,"D2",{"$f":"of:=INT(365.25*[Calcoli.AL71])","v":2459228},null,"D2",{"$f":"of:=INT(365.25*[Calcoli.AO71])","v":2459228}]
["E2",{"$f":"of:=INT(([Calcoli.B70]-[Calcoli.B72])/30.6001)","v":13},null,"E2",{"$f":"of:=INT(([Calcoli.E70]-[Calcoli.E72])/30.6001)","v":14},null,"E2",{"$f":"of:=INT(([Calcoli.H70]-[Calcoli.H72])/30.6001)","v":15},null,"E2",{"$f":"of:=INT(([Calcoli.K70]-[Calcoli.K72])/30.6001)","v":4},null,"E2",{"$f":"of:=INT(([Calcoli.N70]-[Calcoli.N72])/30.6001)","v":5},null,"E2",{"$f":"of:=INT(([Calcoli.Q70]-[Calcoli.Q72])/30.6001)","v":6},null,"E2",{"$f":"of:=INT(([Calcoli.T70]-[Calcoli.T72])/30.6001)","v":7},null,"E2",{"$f":"of:=INT(([Calcoli.W70]-[Calcoli.W72])/30.6001)","v":8},null,"E2",{"$f":"of:=INT(([Calcoli.Z70]-[Calcoli.Z72])/30.6001)","v":8},null,"E2",{"$f":"of:=INT(([Calcoli.AC70]-[Calcoli.AC72])/30.6001)","v":9},null,"E2",{"$f":"of:=INT(([Calcoli.AF70]-[Calcoli.AF72])/30.6001)","v":10},null,"E2",{"$f":"of:=INT(([Calcoli.AI70]-[Calcoli.AI72])/30.6001)","v":11},null,"E2",{"$f":"of:=INT(([Calcoli.AL70]-[Calcoli.AL72])/30.6001)","v":12},null,"E2",{"$f":"of:=INT(([Calcoli.AO70]-[Calcoli.AO72])/30.6001)","v":14}]
["Giorno_PQ",{"$f":"of:=ROUND([Calcoli.B70]-[Calcoli.B72]-INT(30.6001*[Calcoli.B73])+[Calcoli.B67];4)","v":7.3752},null,"Giorno_PQ",{"$f":"of:=ROUND([Calcoli.E70]-[Calcoli.E72]-INT(30.6001*[Calcoli.E73])+[Calcoli.E67];4)","v":5.8222},null,"Giorno_PQ",{"$f":"of:=ROUND([Calcoli.H70]-[Calcoli.H72]-INT(30.6001*[Calcoli.H73])+[Calcoli.H67];4)","v":4.1777},null,"Giorno_PQ",{"$f":"of:=ROUND([Calcoli.K70]-[Calcoli.K72]-INT(30.6001*[Calcoli.K73])+[Calcoli.K67];4)","v":5.4789},null,"Giorno_PQ",{"$f":"of:=ROUND([Calcoli.N70]-[Calcoli.N72]-INT(30.6001*[Calcoli.N73])+[Calcoli.N67];4)","v":3.7756},null,"Giorno_PQ",{"$f":"of:=ROUND([Calcoli.Q70]-[Calcoli.Q72]-INT(30.6001*[Calcoli.Q73])+[Calcoli.Q67];4)","v":3.1139},null,"Giorno_PQ",{"$f":"of:=ROUND([Calcoli.T70]-[Calcoli.T72]-INT(30.6001*[Calcoli.T73])+[Calcoli.T67];4)","v":1.5269},null,"Giorno_PQ",{"$f":"of:=ROUND([Calcoli.W70]-[Calcoli.W72]-INT(30.6001*[Calcoli.W73])+[Calcoli.W67];4)","v":1.0331},null,"Giorno_PQ",{"$f":"of:=ROUND([Calcoli.Z70]-[Calcoli.Z72]-INT(30.6001*[Calcoli.Z73])+[Calcoli.Z67];4)","v":30.6389},null,"Giorno_PQ",{"$f":"of:=ROUND([Calcoli.AC70]-[Calcoli.AC72]-INT(30.6001*[Calcoli.AC73])+[Calcoli.AC67];4)","v":29.3409},null,"Giorno_PQ",{"$f":"of:=ROUND([Calcoli.AF70]-[Calcoli.AF72]-INT(30.6001*[Calcoli.AF73])+[Calcoli.AF67];4)","v":28.1194},null,"Giorno_PQ",{"$f":"of:=ROUND([Calcoli.AI70]-[Calcoli.AI72]-INT(30.6001*[Calcoli.AI73])+[Calcoli.AI67];4)","v":27.9308},null,"Giorno_PQ",{"$f":"of:=ROUND([Calcoli.AL70]-[Calcoli.AL72]-INT(30.6001*[Calcoli.AL73])+[Calcoli.AL67];4)","v":26.7088},null,"Giorno_PQ",{"$f":"of:=ROUND([Calcoli.AO70]-[Calcoli.AO72]-INT(30.6001*[Calcoli.AO73])+[Calcoli.AO67];4)","v":24.9289}]
["Mese_PQ",{"$f":"of:=IF([Calcoli.B73]<13.5;[Calcoli.B73]-1;[Calcoli.B73]-13)","v":12},null,"Mese_PQ",{"$f":"of:=IF([Calcoli.E73]<13.5;[Calcoli.E73]-1;[Calcoli.E73]-13)","v":1},null,"Mese_PQ",{"$f":"of:=IF([Calcoli.H73]<13.5;[Calcoli.H73]-1;[Calcoli.H73]-13)","v":2},null,"Mese_PQ",{"$f":"of:=IF([Calcoli.K73]<13.5;[Calcoli.K73]-1;[Calcoli.K73]-13)","v":3},null,"Mese_PQ",{"$f":"of:=IF([Calcoli.N73]<13.5;[Calcoli.N73]-1;[Calcoli.N73]-13)","v":4},null,"Mese_PQ",{"$f":"of:=IF([Calcoli.Q73]<13.5;[Calcoli.Q73]-1;[Calcoli.Q73]-13)","v":5},null,"Mese_PQ",{"$f":"of:=IF([Calcoli.T73]<13.5;[Calcoli.T73]-1;[Calcoli.T73]-13)","v":6},null,"Mese_PQ",{"$f":"of:=IF([Calcoli.W73]<13.5;[Calcoli.W73]-1;[Calcoli.W73]-13)","v":7},null,"Mese_PQ",{"$f":"of:=IF([Calcoli.Z73]<13.5;[Calcoli.Z73]-1;[Calcoli.Z73]-13)","v":7},null,"Mese_PQ",{"$f":"of:=IF([Calcoli.AC73]<13.5;[Calcoli.AC73]-1;[Calcoli.AC73]-13)","v":8},null,"Mese_PQ",{"$f":"of:=IF([Calcoli.AF73]<13.5;[Calcoli.AF73]-1;[Calcoli.AF73]-13)","v":9},null,"Mese_PQ",{"$f":"of:=IF([Calcoli.AI73]<13.5;[Calcoli.AI73]-1;[Calcoli.AI73]-13)","v":10},null,"Mese_PQ",{"$f":"of:=IF([Calcoli.AL73]<13.5;[Calcoli.AL73]-1;[Calcoli.AL73]-13)","v":11},null,"Mese_PQ",{"$f":"of:=IF([Calcoli.AO73]<13.5;[Calcoli.AO73]-1;[Calcoli.AO73]-13)","v":1}]
["ANNO_PQ",{"$f":"of:=IF([Calcoli.B75]>2.5 AND([Calcoli.B75]<12.5);[Calcoli.B71]-4716;[Calcoli.B71]-4715)","v":2016},null,"ANNO_PQ",{"$f":"of:=IF([Calcoli.E75]>2.5 AND([Calcoli.E75]<12.5);[Calcoli.E71]-4716;[Calcoli.E71]-4715)","v":2017},null,"ANNO_PQ",{"$f":"of:=IF([Calcoli.H75]>2.5 AND([Calcoli.H75]<12.5);[Calcoli.H71]-4716;[Calcoli.H71]-4715)","v":2017},null,"ANNO_PQ",{"$f":"of:=IF([Calcoli.K75]>2.5 AND([Calcoli.K75]<12.5);[Calcoli.K71]-4716;[Calcoli.K71]-4715)","v":2017},null,"ANNO_PQ",{"$f":"of:=IF([Calcoli.N75]>2.5 AND([Calcoli.N75]<12.5);[Calcoli.N71]-4716;[Calcoli.N71]-4715)","v":2017},null,"ANNO_PQ",{"$f":"of:=IF([Calcoli.Q75]>2.5 AND([Calcoli.Q75]<12.5);[Calcoli.Q71]-4716;[Calcoli.Q71]-4715)","v":2017},null,"ANNO_PQ",{"$f":"of:=IF([Calcoli.T75]>2.5 AND([Calcoli.T75]<12.5);[Calcoli.T71]-4716;[Calcoli.T71]-4715)","v":2017},null,"ANNO_PQ",{"$f":"of:=IF([Calcoli.W75]>2.5 AND([Calcoli.W75]<12.5);[Calcoli.W71]-4716;[Calcoli.W71]-4715)","v":2017},null,"ANNO_PQ",{"$f":"of:=IF([Calcoli.Z75]>2.5 AND([Calcoli.Z75]<12.5);[Calcoli.Z71]-4716;[Calcoli.Z71]-4715)","v":2017},null,"ANNO_PQ",{"$f":"of:=IF([Calcoli.AC75]>2.5 AND([Calcoli.AC75]<12.5);[Calcoli.AC71]-4716;[Calcoli.AC71]-4715)","v":2017},null,"ANNO_PQ",{"$f":"of:=IF([Calcoli.AF75]>2.5 AND([Calcoli.AF75]<12.5);[Calcoli.AF71]-4716;[Calcoli.AF71]-4715)","v":2017},null,"ANNO_PQ",{"$f":"of:=IF([Calcoli.AI75]>2.5 AND([Calcoli.AI75]<12.5);[Calcoli.AI71]-4716;[Calcoli.AI71]-4715)","v":2017},null,"ANNO_PQ",{"$f":"of:=IF([Calcoli.AL75]>2.5 AND([Calcoli.AL75]<12.5);[Calcoli.AL71]-4716;[Calcoli.AL71]-4715)","v":2017},null,"ANNO_PQ",{"$f":"of:=IF([Calcoli.AO75]>2.5 AND([Calcoli.AO75]<12.5);[Calcoli.AO71]-4716;[Calcoli.AO71]-4715)","v":2018}]
["Data_GD PQ",{"$f":"of:=DATE([Calcoli.B76];[Calcoli.B75];[Calcoli.B74])","v":"2016-12-07"},null,"Data_GD PQ",{"$f":"of:=DATE([Calcoli.E76];[Calcoli.E75];[Calcoli.E74])","v":"2017-01-05"},null,"Data_GD PQ",{"$f":"of:=DATE([Calcoli.H76];[Calcoli.H75];[Calcoli.H74])","v":"2017-02-04"},null,"Data_GD PQ",{"$f":"of:=DATE([Calcoli.K76];[Calcoli.K75];[Calcoli.K74])","v":"2017-03-05"},null,"Data_GD PQ",{"$f":"of:=DATE([Calcoli.N76];[Calcoli.N75];[Calcoli.N74])","v":"2017-04-03"},null,"Data_GD PQ",{"$f":"of:=DATE([Calcoli.Q76];[Calcoli.Q75];[Calcoli.Q74])","v":"2017-05-03"},null,"Data_GD PQ",{"$f":"of:=DATE([Calcoli.T76];[Calcoli.T75];[Calcoli.T74])","v":"2017-06-01"},null,"Data_GD PQ",{"$f":"of:=DATE([Calcoli.W76];[Calcoli.W75];[Calcoli.W74])","v":"2017-07-01"},null,"Data_GD PQ",{"$f":"of:=DATE([Calcoli.Z76];[Calcoli.Z75];[Calcoli.Z74])","v":"2017-07-30"},null,"Data_GD PQ",{"$f":"of:=DATE([Calcoli.AC76];[Calcoli.AC75];[Calcoli.AC74])","v":"2017-08-29"},null,"Data_GD PQ",{"$f":"of:=DATE([Calcoli.AF76];[Calcoli.AF75];[Calcoli.AF74])","v":"2017-09-28"},null,"Data_GD PQ",{"$f":"of:=DATE([Calcoli.AI76];[Calcoli.AI75];[Calcoli.AI74])","v":"2017-10-27"},null,"Data_GD PQ",{"$f":"of:=DATE([Calcoli.AL76];[Calcoli.AL75];[Calcoli.AL74])","v":"2017-11-26"},null,"Data_GD PQ",{"$f":"of:=DATE([Calcoli.AO76];[Calcoli.AO75];[Calcoli.AO74])","v":"2018-01-24"}]
["Ore_GD PQ",{"$f":"of:=INT(([Calcoli.B74]-INT([Calcoli.B74]))*24)+1","v":10},null,"Ore_GD PQ",{"$f":"of:=INT(([Calcoli.E74]-INT([Calcoli.E74]))*24)+1","v":20},null,"Ore_GD PQ",{"$f":"of:=INT(([Calcoli.H74]-INT([Calcoli.H74]))*24)+1","v":5},null,"Ore_GD PQ",{"$f":"of:=INT(([Calcoli.K74]-INT([Calcoli.K74]))*24)+1","v":12},null,"Ore_GD PQ",{"$f":"of:=INT(([Calcoli.N74]-INT([Calcoli.N74]))*24)+1","v":19},null,"Ore_GD PQ",{"$f":"of:=INT(([Calcoli.Q74]-INT([Calcoli.Q74]))*24)+1","v":3},null,"Ore_GD PQ",{"$f":"of:=INT(([Calcoli.T74]-INT([Calcoli.T74]))*24)+1","v":13},null,"Ore_GD PQ",{"$f":"of:=INT(([Calcoli.W74]-INT([Calcoli.W74]))*24)+1","v":1},null,"Ore_GD PQ",{"$f":"of:=INT(([Calcoli.Z74]-INT([Calcoli.Z74]))*24)+1","v":16},null,"Ore_GD PQ",{"$f":"of:=INT(([Calcoli.AC74]-INT([Calcoli.AC74]))*24)+1","v":9},null,"Ore_GD PQ",{"$f":"of:=INT(([Calcoli.AF74]-INT([Calcoli.AF74]))*24)+1","v":3},null,"Ore_GD PQ",{"$f":"of:=INT(([Calcoli.AI74]-INT([Calcoli.AI74]))*24)+1","v":23},null,"Ore_GD PQ",{"$f":"of:=INT(([Calcoli.AL74]-INT([Calcoli.AL74]))*24)+1","v":18},null,"Ore_GD PQ",{"$f":"of:=INT(([Calcoli.AO74]-INT([Calcoli.AO74]))*24)+1","v":23}]
["Minuti_GD PQ",{"$f":"of:=INT((([Calcoli.B74]-INT([Calcoli.B74]))*24-([Calcoli.B78]-1))*60)","v":0},null,"Minuti_GD PQ",{"$f":"of:=INT((([Calcoli.E74]-INT([Calcoli.E74]))*24-([Calcoli.E78]-1))*60)","v":43},null,"Minuti_GD PQ",{"$f":"of:=INT((([Calcoli.H74]-INT([Calcoli.H74]))*24-([Calcoli.H78]-1))*60)","v":15},null,"Minuti_GD PQ",{"$f":"of:=INT((([Calcoli.K74]-INT([Calcoli.K74]))*24-([Calcoli.K78]-1))*60)","v":29},null,"Minuti_GD PQ",{"$f":"of:=INT((([Calcoli.N74]-INT([Calcoli.N74]))*24-([Calcoli.N78]-1))*60)","v":36},null,"Minuti_GD PQ",{"$f":"of:=INT((([Calcoli.Q74]-INT([Calcoli.Q74]))*24-([Calcoli.Q78]-1))*60)","v":44},null,"Minuti_GD PQ",{"$f":"of:=INT((([Calcoli.T74]-INT([Calcoli.T74]))*24-([Calcoli.T78]-1))*60)","v":38},null,"Minuti_GD PQ",{"$f":"of:=INT((([Calcoli.W74]-INT([Calcoli.W74]))*24-([Calcoli.W78]-1))*60)","v":47},null,"Minuti_GD PQ",{"$f":"of:=INT((([Calcoli.Z74]-INT([Calcoli.Z74]))*24-([Calcoli.Z78]-1))*60)","v":20},null,"Minuti_GD PQ",{"$f":"of:=INT((([Calcoli.AC74]-INT([Calcoli.AC74]))*24-([Calcoli.AC78]-1))*60)","v":10},null,"Minuti_GD PQ",{"$f":"of:=INT((([Calcoli.AF74]-INT([Calcoli.AF74]))*24-([Calcoli.AF78]-1))*60)","v":51},null,"Minuti_GD PQ",{"$f":"of:=INT((([Calcoli.AI74]-INT([Calcoli.AI74]))*24-([Calcoli.AI78]-1))*60)","v":20},null,"Minuti_GD PQ",{"$f":"of:=INT((([Calcoli.AL74]-INT([Calcoli.AL74]))*24-([Calcoli.AL78]-1))*60)","v":0},null,"Minuti_GD PQ",{"$f":"of:=INT((([Calcoli.AO74]-INT([Calcoli.AO74]))*24-([Calcoli.AO78]-1))*60)","v":17}]
["Secondi_GD PQ",{"$f":"of:=INT((((([Calcoli.B74]-INT([Calcoli.B74]))*24-([Calcoli.B78]-1))*60)-[Calcoli.B79])*60)","v":17},null,"Secondi_GD PQ",{"$f":"of:=INT((((([Calcoli.E74]-INT([Calcoli.E74]))*24-([Calcoli.E78]-1))*60)-[Calcoli.E79])*60)+60","v":118},null,"Secondi_GD PQ",{"$f":"of:=INT((((([Calcoli.H74]-INT([Calcoli.H74]))*24-([Calcoli.H78]-1))*60)-[Calcoli.H79])*60)+60","v":113},null,"Secondi_GD PQ",{"$f":"of:=INT((((([Calcoli.K74]-INT([Calcoli.K74]))*24-([Calcoli.K78]-1))*60)-[Calcoli.K79])*60)","v":36},null,"Secondi_GD PQ",{"$f":"of:=INT((((([Calcoli.N74]-INT([Calcoli.N74]))*24-([Calcoli.N78]-1))*60)-[Calcoli.N79])*60)","v":51},null,"Secondi_GD PQ",{"$f":"of:=INT((((([Calcoli.Q74]-INT([Calcoli.Q74]))*24-([Calcoli.Q78]-1))*60)-[Calcoli.Q79])*60)","v":0},null,"Secondi_GD PQ",{"$f":"of:=INT((((([Calcoli.T74]-INT([Calcoli.T74]))*24-([Calcoli.T78]-1))*60)-[Calcoli.T79])*60)","v":44},null,"Secondi_GD PQ",{"$f":"of:=INT((((([Calcoli.W74]-INT([Calcoli.W74]))*24-([Calcoli.W78]-1))*60)-[Calcoli.W79])*60)","v":39},null,"Secondi_GD PQ",{"$f":"of:=INT((((([Calcoli.Z74]-INT([Calcoli.Z74]))*24-([Calcoli.Z78]-1))*60)-[Calcoli.Z79])*60)","v":0},null,"Secondi_GD PQ",{"$f":"of:=INT((((([Calcoli.AC74]-INT([Calcoli.AC74]))*24-([Calcoli.AC78]-1))*60)-[Calcoli.AC79])*60)","v":53},null,"Secondi_GD PQ",{"$f":"of:=INT((((([Calcoli.AF74]-INT([Calcoli.AF74]))*24-([Calcoli.AF78]-1))*60)-[Calcoli.AF79])*60)","v":56},null,"Secondi_GD PQ",{"$f":"of:=INT((((([Calcoli.AI74]-INT([Calcoli.AI74]))*24-([Calcoli.AI78]-1))*60)-[Calcoli.AI79])*60)","v":21},null,"Secondi_GD PQ",{"$f":"of:=INT((((([Calcoli.AL74]-INT([Calcoli.AL74]))*24-([Calcoli.AL78]-1))*60)-[Calcoli.AL79])*60)","v":40},null,"Secondi_GD PQ",{"$f":"of:=INT((((([Calcoli.AO74]-INT([Calcoli.AO74]))*24-([Calcoli.AO78]-1))*60)-[Calcoli.AO79])*60)","v":36}]
["JD_Data LP",{"$f":"of:=[Calcoli.B40]","v":2457736.5048},null,"JD_Data LP",{"$f":"of:=[Calcoli.E40]","v":2457765.9828},null,"JD_Data LP",{"$f":"of:=[Calcoli.H40]","v":2457795.5237},null,"JD_Data LP",{"$f":"of:=[Calcoli.K40]","v":2457825.1215},null,"JD_Data LP",{"$f":"of:=[Calcoli.N40]","v":2457854.7566},null,"JD_Data LP",{"$f":"of:=[Calcoli.Q40]","v":2457884.4057},null,"JD_Data LP",{"$f":"of:=[Calcoli.T40]","v":2457914.0497},null,"JD_Data LP",{"$f":"of:=[Calcoli.W40]","v":2457943.6728},null,"JD_Data LP",{"$f":"of:=[Calcoli.Z40]","v":2457973.2592},null,"JD_Data LP",{"$f":"of:=[Calcoli.AC40]","v":2458002.7954},null,"JD_Data LP",{"$f":"of:=[Calcoli.AF40]","v":2458032.2794},null,"JD_Data LP",{"$f":"of:=[Calcoli.AI40]","v":2458061.7257},null,"JD_Data LP",{"$f":"of:=[Calcoli.AL40]","v":2458091.1591},null,"JD_Data LP",{"$f":"of:=[Calcoli.AO40]","v":2458150.0614}]
["Z3",{"$f":"of:=INT([Calcoli.B81]+0.5)","v":2457737},null,"Z3",{"$f":"of:=INT([Calcoli.E81]+0.5)","v":2457766},null,"Z3",{"$f":"of:=INT([Calcoli.H81]+0.5)","v":2457796},null,"Z3",{"$f":"of:=INT([Calcoli.K81]+0.5)","v":2457825},null,"Z3",{"$f":"of:=INT([Calcoli.N81]+0.5)","v":2457855},null,"Z3",{"$f":"of:=INT([Calcoli.Q81]+0.5)","v":2457884},null,"Z3",{"$f":"of:=INT([Calcoli.T81]+0.5)","v":2457914},null,"Z3",{"$f":"of:=INT([Calcoli.W81]+0.5)","v":2457944},null,"Z3",{"$f":"of:=INT([Calcoli.Z81]+0.5)","v":2457973},null,"Z3",{"$f":"of:=INT([Calcoli.AC81]+0.5)","v":2458003},null,"Z3",{"$f":"of:=INT([Calcoli.AF81]+0.5)","v":2458032},null,"Z3",{"$f":"of:=INT([Calcoli.AI81]+0.5)","v":2458062},null,"Z3",{"$f":"of:=INT([Calcoli.AL81]+0.5)","v":2458091},null,"Z3",{"$f":"of:=INT([Calcoli.AO81]+0.5)","v":2458150}]
["F3",{"$f":"of:=[Calcoli.B81]+0.5-INT([Calcoli.B81]+0.5)","v":0.00480000022798777},null,"F3",{"$f":"of:=[Calcoli.E81]+0.5-INT([Calcoli.E81]+0.5)","v":0.482799999881536},null,"F3",{"$f":"of:=[Calcoli.H81]+0.5-INT([Calcoli.H81]+0.5)","v":0.0236999997869134},null,"F3",{"$f":"of:=[Calcoli.K81]+0.5-INT([Calcoli.K81]+0.5)","v":0.621499999891967},null,"F3",{"$f":"of:=[Calcoli.N81]+0.5-INT([Calcoli.N81]+0.5)","v":0.256599999964237},null,"F3",{"$f":"of:=[Calcoli.Q81]+0.5-INT([Calcoli.Q81]+0.5)","v":0.90570000000298},null,"F3",{"$f":"of:=[Calcoli.T81]+0.5-INT([Calcoli.T81]+0.5)","v":0.549699999857694},null,"F3",{"$f":"of:=[Calcoli.W81]+0.5-INT([Calcoli.W81]+0.5)","v":0.172799999825656},null,"F3",{"$f":"of:=[Calcoli.Z81]+0.5-INT([Calcoli.Z81]+0.5)","v":0.759200000204146},null,"F3",{"$f":"of:=[Calcoli.AC81]+0.5-INT([Calcoli.AC81]+0.5)","v":0.295400000177324},null,"F3",{"$f":"of:=[Calcoli.AF81]+0.5-INT([Calcoli.AF81]+0.5)","v":0.779399999883026},null,"F3",{"$f":"of:=[Calcoli.AI81]+0.5-INT([Calcoli.AI81]+0.5)","v":0.225699999835342},null,"F3",{"$f":"of:=[Calcoli.AL81]+0.5-INT([Calcoli.AL81]+0.5)","v":0.659099999815226},null,"F3",{"$f":"of:=[Calcoli.AO81]+0.5-INT([Calcoli.AO81]+0.5)","v":0.56140000000596}]
["Ω3",{"$f":"of:=INT(([Calcoli.B82]-1867216.25)/36524.25)","v":16},null,"Ω3",{"$f":"of:=INT(([Calcoli.E82]-1867216.25)/36524.25)","v":16},null,"Ω3",{"$f":"of:=INT(([Calcoli.H82]-1867216.25)/36524.25)","v":16},null,"Ω3",{"$f":"of:=INT(([Calcoli.K82]-1867216.25)/36524.25)","v":16},null,"Ω3",{"$f":"of:=INT(([Calcoli.N82]-1867216.25)/36524.25)","v":16},null,"Ω3",{"$f":"of:=INT(([Calcoli.Q82]-1867216.25)/36524.25)","v":16},null,"Ω3",{"$f":"of:=INT(([Calcoli.T82]-1867216.25)/36524.25)","v":16},null,"Ω3",{"$f":"of:=INT(([Calcoli.W82]-1867216.25)/36524.25)","v":16},null,"Ω3",{"$f":"of:=INT(([Calcoli.Z82]-1867216.25)/36524.25)","v":16},null,"Ω3",{"$f":"of:=INT(([Calcoli.AC82]-1867216.25)/36524.25)","v":16},null,"Ω3",{"$f":"of:=INT(([Calcoli.AF82]-1867216.25)/36524.25)","v":16},null,"Ω3",{"$f":"of:=INT(([Calcoli.AI82]-1867216.25)/36524.25)","v":16},null,"Ω3",{"$f":"of:=INT(([Calcoli.AL82]-1867216.25)/36524.25)","v":16},null,"Ω3",{"$f":"of:=INT(([Calcoli.AO82]-1867216.25)/36524.25)","v":16}]
["A3",{"$f":"of:=IF([Calcoli.B82]<2299161;[Calcoli.B82];[Calcoli.B82]+1+[Calcoli.B84]-INT([Calcoli.B84]/4))","v":2457750},null,"A3",{"$f":"of:=IF([Calcoli.E82]<2299161;[Calcoli.E82];[Calcoli.E82]+1+[Calcoli.E84]-INT([Calcoli.E84]/4))","v":2457779},null,"A3",{"$f":"of:=IF([Calcoli.H82]<2299161;[Calcoli.H82];[Calcoli.H82]+1+[Calcoli.H84]-INT([Calcoli.H84]/4))","v":2457809},null,"A3",{"$f":"of:=IF([Calcoli.K82]<2299161;[Calcoli.K82];[Calcoli.K82]+1+[Calcoli.K84]-INT([Calcoli.K84]/4))","v":2457838},null,"A3",{"$f":"of:=IF([Calcoli.N82]<2299161;[Calcoli.N82];[Calcoli.N82]+1+[Calcoli.N84]-INT([Calcoli.N84]/4))","v":2457868},null,"A3",{"$f":"of:=IF([Calcoli.Q82]<2299161;[Calcoli.Q82];[Calcoli.Q82]+1+[Calcoli.Q84]-INT([Calcoli.Q84]/4))","v":2457897},null,"A3",{"$f":"of:=IF([Calcoli.T82]<2299161;[Calcoli.T82];[Calcoli.T82]+1+[Calcoli.T84]-INT([Calcoli.T84]/4))","v":2457927},null,"A3",{"$f":"of:=IF([Calcoli.W82]<2299161;[Calcoli.W82];[Calcoli.W82]+1+[Calcoli.W84]-INT([Calcoli.W84]/4))","v":2457957},null,"A3",{"$f":"of:=IF([Calcoli.Z82]<2299161;[Calcoli.Z82];[Calcoli.Z82]+1+[Calcoli.Z84]-INT([Calcoli.Z84]/4))","v":2457986},null,"A3",{"$f":"of:=IF([Calcoli.AC82]<2299161;[Calcoli.AC82];[Calcoli.AC82]+1+[Calcoli.AC84]-INT([Calcoli.AC84]/4))","v":2458016},null,"A3",{"$f":"of:=IF([Calcoli.AF82]<2299161;[Calcoli.AF82];[Calcoli.AF82]+1+[Calcoli.AF84]-INT([Calcoli.AF84]/4))","v":2458045},null,"A3",{"$f":"of:=IF([Calcoli.AI82]<2299161;[Calcoli.AI82];[Calcoli.AI82]+1+[Calcoli.AI84]-INT([Calcoli.AI84]/4))","v":2458075},null,"A3",{"$f":"of:=IF([Calcoli.AL82]<2299161;[Calcoli.AL82];[Calcoli.AL82]+1+[Calcoli.AL84]-INT([Calcoli.AL84]/4))","v":2458104},null,"A3",{"$f":"of:=IF([Calcoli.AO82]<2299161;[Calcoli.AO82];[Calcoli.AO82]+1+[Calcoli.AO84]-INT([Calcoli.AO84]/4))","v":2458163}]
["B3",{"$f":"of:=[Calcoli.B85]+1524","v":2459274},null,"B3",{"$f":"of:=[Calcoli.E85]+1524","v":2459303},null,"B3",{"$f":"of:=[Calcoli.H85]+1524","v":2459333},null,"B3",{"$f":"of:=[Calcoli.K85]+1524","v":2459362},null,"B3",{"$f":"of:=[Calcoli.N85]+1524","v":2459392},null,"B3",{"$f":"of:=[Calcoli.Q85]+1524","v":2459421},null,"B3",{"$f":"of:=[Calcoli.T85]+1524","v":2459451},null,"B3",{"$f":"of:=[Calcoli.W85]+1524","v":2459481},null,"B3",{"$f":"of:=[Calcoli.Z85]+1524","v":2459510},null,"B3",{"$f":"of:=[Calcoli.AC85]+1524","v":2459540},null,"B3",{"$f":"of:=[Calcoli.AF85]+1524","v":2459569},null,"B3",{"$f":"of:=[Calcoli.AI85]+1524","v":2459599},null,"B3",{"$f":"of:=[Calcoli.AL85]+1524","v":2459628},null,"B3",{"$f":"of:=[Calcoli.AO85]+1524","v":2459687}]
["C3",{"$f":"of:=INT(([Calcoli.B86]-122.1)/365.25)","v":6732},null,"C3",{"$f":"of:=INT(([Calcoli.E86]-122.1)/365.25)","v":6732},null,"C3",{"$f":"of:=INT(([Calcoli.H86]-122.1)/365.25)","v":6732},null,"C3",{"$f":"of:=INT(([Calcoli.K86]-122.1)/365.25)","v":6733},null,"C3",{"$f":"of:=INT(([Calcoli.N86]-122.1)/365.25)","v":6733},null,"C3",{"$f":"of:=INT(([Calcoli.Q86]-122.1)/365.25)","v":6733},null,"C3",{"$f":"of:=INT(([Calcoli.T86]-122.1)/365.25)","v":6733},null,"C3",{"$f":"of:=INT(([Calcoli.W86]-122.1)/365.25)","v":6733},null,"C3",{"$f":"of:=INT(([Calcoli.Z86]-122.1)/365.25)","v":6733},null,"C3",{"$f":"of:=INT(([Calcoli.AC86]-122.1)/365.25)","v":6733},null,"C3",{"$f":"of:=INT(([Calcoli.AF86]-122.1)/365.25)","v":6733},null,"C3",{"$f":"of:=INT(([Calcoli.AI86]-122.1)/365.25)","v":6733},null,"C3",{"$f":"of:=INT(([Calcoli.AL86]-122.1)/365.25)","v":6733},null,"C3",{"$f":"of:=INT(([Calcoli.AO86]-122.1)/365.25)","v":6733}]
["D3",{"$f":"of:=INT(365.25*[Calcoli.B87])","v":2458863},null,"D3",{"$f":"of:=INT(365.25*[Calcoli.E87])","v":2458863},null,"D3",{"$f":"of:=INT(365.25*[Calcoli.H87])","v":2458863},null,"D3",{"$f":"of:=INT(365.25*[Calcoli.K87])","v":2459228},null,"D3",{"$f":"of:=INT(365.25*[Calcoli.N87])","v":2459228},null,"D3",{"$f":"of:=INT(365.25*[Calcoli.Q87])","v":2459228},null,"D3",{"$f":"of:=INT(365.25*[Calcoli.T87])","v":2459228},null,"D3",{"$f":"of:=INT(365.25*[Calcoli.W87])","v":2459228},null,"D3",{"$f":"of:=INT(365.25*[Calcoli.Z87])","v":2459228},null,"D3",{"$f":"of:=INT(365.25*[Calcoli.AC87])","v":2459228},null,"D3",{"$f":"of:=INT(365.25*[Calcoli.AF87])","v":2459228},null,"D3",{"$f":"of:=INT(365.25*[Calcoli.AI87])","v":2459228},null,"D3",{"$f":"of:=INT(365.25*[Calcoli.AL87])","v":2459228},null,"D3",{"$f":"of:=INT(365.25*[Calcoli.AO87])","v":2459228}]
["E3",{"$f":"of:=INT(([Calcoli.B86]-[Calcoli.B88])/30.6001)","v":13},null,"E3",{"$f":"of:=INT(([Calcoli.E86]-[Calcoli.E88])/30.6001)","v":14},null,"E3",{"$f":"of:=INT(([Calcoli.H86]-[Calcoli.H88])/30.6001)","v":15},null,"E3",{"$f":"of:=INT(([Calcoli.K86]-[Calcoli.K88])/30.6001)","v":4},null,"E3",{"$f":"of:=INT(([Calcoli.N86]-[Calcoli.N88])/30.6001)","v":5},null,"E3",{"$f":"of:=INT(([Calcoli.Q86]-[Calcoli.Q88])/30.6001)","v":6},null,"E3",{"$f":"of:=INT(([Calcoli.T86]-[Calcoli.T88])/30.6001)","v":7},null,"E3",{"$f":"of:=INT(([Calcoli.W86]-[Calcoli.W88])/30.6001)","v":8},null,"E3",{"$f":"of:=INT(([Calcoli.Z86]-[Calcoli.Z88])/30.6001)","v":9},null,"E3",{"$f":"of:=INT(([Calcoli.AC86]-[Calcoli.AC88])/30.6001)","v":10},null,"E3",{"$f":"of:=INT(([Calcoli.AF86]-[Calcoli.AF88])/30.6001)","v":11},null,"E3",{"$f":"of:=INT(([Calcoli.AI86]-[Calcoli.AI88])/30.6001)","v":12},null,"E3",{"$f":"of:=INT(([Calcoli.AL86]-[Calcoli.AL88])/30.6001)","v":13},null,"E3",{"$f":"of:=INT(([Calcoli.AO86]-[Calcoli.AO88])/30.6001)","v":14}]
["Giorno_LP",{"$f":"of:=ROUND([Calcoli.B86]-[Calcoli.B88]-INT(30.6001*[Calcoli.B89])+[Calcoli.B83];4)","v":14.0048},null,"Giorno_LP",{"$f":"of:=ROUND([Calcoli.E86]-[Calcoli.E88]-INT(30.6001*[Calcoli.E89])+[Calcoli.E83];4)","v":12.4828},null,"Giorno_LP",{"$f":"of:=ROUND([Calcoli.H86]-[Calcoli.H88]-INT(30.6001*[Calcoli.H89])+[Calcoli.H83];4)","v":11.0237},null,"Giorno_LP",{"$f":"of:=ROUND([Calcoli.K86]-[Calcoli.K88]-INT(30.6001*[Calcoli.K89])+[Calcoli.K83];4)","v":12.6215},null,"Giorno_LP",{"$f":"of:=ROUND([Calcoli.N86]-[Calcoli.N88]-INT(30.6001*[Calcoli.N89])+[Calcoli.N83];4)","v":11.2566},null,"Giorno_LP",{"$f":"of:=ROUND([Calcoli.Q86]-[Calcoli.Q88]-INT(30.6001*[Calcoli.Q89])+[Calcoli.Q83];4)","v":10.9057},null,"Giorno_LP",{"$f":"of:=ROUND([Calcoli.T86]-[Calcoli.T88]-INT(30.6001*[Calcoli.T89])+[Calcoli.T83];4)","v":9.5497},null,"Giorno_LP",{"$f":"of:=ROUND([Calcoli.W86]-[Calcoli.W88]-INT(30.6001*[Calcoli.W89])+[Calcoli.W83];4)","v":9.1728},null,"Giorno_LP",{"$f":"of:=ROUND([Calcoli.Z86]-[Calcoli.Z88]-INT(30.6001*[Calcoli.Z89])+[Calcoli.Z83];4)","v":7.7592},null,"Giorno_LP",{"$f":"of:=ROUND([Calcoli.AC86]-[Calcoli.AC88]-INT(30.6001*[Calcoli.AC89])+[Calcoli.AC83];4)","v":6.2954},null,"Giorno_LP",{"$f":"of:=ROUND([Calcoli.AF86]-[Calcoli.AF88]-INT(30.6001*[Calcoli.AF89])+[Calcoli.AF83];4)","v":5.7794},null,"Giorno_LP",{"$f":"of:=ROUND([Calcoli.AI86]-[Calcoli.AI88]-INT(30.6001*[Calcoli.AI89])+[Calcoli.AI83];4)","v":4.2257},null,"Giorno_LP",{"$f":"of:=ROUND([Calcoli.AL86]-[Calcoli.AL88]-INT(30.6001*[Calcoli.AL89])+[Calcoli.AL83];4)","v":3.6591},null,"Giorno_LP",{"$f":"of:=ROUND([Calcoli.AO86]-[Calcoli.AO88]-INT(30.6001*[Calcoli.AO89])+[Calcoli.AO83];4)","v":31.5614}]
["Mese_LP",{"$f":"of:=IF([Calcoli.B89]<13.5;[Calcoli.B89]-1;[Calcoli.B89]-13)","v":12},null,"Mese_LP",{"$f":"of:=IF([Calcoli.E89]<13.5;[Calcoli.E89]-1;[Calcoli.E89]-13)","v":1},null,"Mese_LP",{"$f":"of:=IF([Calcoli.H89]<13.5;[Calcoli.H89]-1;[Calcoli.H89]-13)","v":2},null,"Mese_LP",{"$f":"of:=IF([Calcoli.K89]<13.5;[Calcoli.K89]-1;[Calcoli.K89]-13)","v":3},null,"Mese_LP",{"$f":"of:=IF([Calcoli.N89]<13.5;[Calcoli.N89]-1;[Calcoli.N89]-13)","v":4},null,"Mese_LP",{"$f":"of:=IF([Calcoli.Q89]<13.5;[Calcoli.Q89]-1;[Calcoli.Q89]-13)","v":5},null,"Mese_LP",{"$f":"of:=IF([Calcoli.T89]<13.5;[Calcoli.T89]-1;[Calcoli.T89]-13)","v":6},null,"Mese_LP",{"$f":"of:=IF([Calcoli.W89]<13.5;[Calcoli.W89]-1;[Calcoli.W89]-13)","v":7},null,"Mese_LP",{"$f":"of:=IF([Calcoli.Z89]<13.5;[Calcoli.Z89]-1;[Calcoli.Z89]-13)","v":8},null,"Mese_LP",{"$f":"of:=IF([Calcoli.AC89]<13.5;[Calcoli.AC89]-1;[Calcoli.AC89]-13)","v":9},null,"Mese_LP",{"$f":"of:=IF([Calcoli.AF89]<13.5;[Calcoli.AF89]-1;[Calcoli.AF89]-13)","v":10},null,"Mese_LP",{"$f":"of:=IF([Calcoli.AI89]<13.5;[Calcoli.AI89]-1;[Calcoli.AI89]-13)","v":11},null,"Mese_LP",{"$f":"of:=IF([Calcoli.AL89]<13.5;[Calcoli.AL89]-1;[Calcoli.AL89]-13)","v":12},null,"Mese_LP",{"$f":"of:=IF([Calcoli.AO89]<13.5;[Calcoli.AO89]-1;[Calcoli.AO89]-13)","v":1}]
["ANNO_LP",{"$f":"of:=IF([Calcoli.B91]>2.5 AND([Calcoli.B91]<12.5);[Calcoli.B87]-4716;[Calcoli.B87]-4715)","v":2016},null,"ANNO_LP",{"$f":"of:=IF([Calcoli.E91]>2.5 AND([Calcoli.E91]<12.5);[Calcoli.E87]-4716;[Calcoli.E87]-4715)","v":2017},null,"ANNO_LP",{"$f":"of:=IF([Calcoli.H91]>2.5 AND([Calcoli.H91]<12.5);[Calcoli.H87]-4716;[Calcoli.H87]-4715)","v":2017},null,"ANNO_LP",{"$f":"of:=IF([Calcoli.K91]>2.5 AND([Calcoli.K91]<12.5);[Calcoli.K87]-4716;[Calcoli.K87]-4715)","v":2017},null,"ANNO_LP",{"$f":"of:=IF([Calcoli.N91]>2.5 AND([Calcoli.N91]<12.5);[Calcoli.N87]-4716;[Calcoli.N87]-4715)","v":2017},null,"ANNO_LP",{"$f":"of:=IF([Calcoli.Q91]>2.5 AND([Calcoli.Q91]<12.5);[Calcoli.Q87]-4716;[Calcoli.Q87]-4715)","v":2017},null,"ANNO_LP",{"$f":"of:=IF([Calcoli.T91]>2.5 AND([Calcoli.T91]<12.5);[Calcoli.T87]-4716;[Calcoli.T87]-4715)","v":2017},null,"ANNO_LP",{"$f":"of:=IF([Calcoli.W91]>2.5 AND([Calcoli.W91]<12.5);[Calcoli.W87]-4716;[Calcoli.W87]-4715)","v":2017},null,"ANNO_LP",{"$f":"of:=IF([Calcoli.Z91]>2.5 AND([Calcoli.Z91]<12.5);[Calcoli.Z87]-4716;[Calcoli.Z87]-4715)","v":2017},null,"ANNO_LP",{"$f":"of:=IF([Calcoli.AC91]>2.5 AND([Calcoli.AC91]<12.5);[Calcoli.AC87]-4716;[Calcoli.AC87]-4715)","v":2017},null,"ANNO_LP",{"$f":"of:=IF([Calcoli.AF91]>2.5 AND([Calcoli.AF91]<12.5);[Calcoli.AF87]-4716;[Calcoli.AF87]-4715)","v":2017},null,"ANNO_LP",{"$f":"of:=IF([Calcoli.AI91]>2.5 AND([Calcoli.AI91]<12.5);[Calcoli.AI87]-4716;[Calcoli.AI87]-4715)","v":2017},null,"ANNO_LP",{"$f":"of:=IF([Calcoli.AL91]>2.5 AND([Calcoli.AL91]<12.5);[Calcoli.AL87]-4716;[Calcoli.AL87]-4715)","v":2017},null,"ANNO_LP",{"$f":"of:=IF([Calcoli.AO91]>2.5 AND([Calcoli.AO91]<12.5);[Calcoli.AO87]-4716;[Calcoli.AO87]-4715)","v":2018}]
["Data_GD LP",{"$f":"of:=DATE([Calcoli.B92];[Calcoli.B91];[Calcoli.B90])","v":"2016-12-14"},null,"Data_GD LP",{"$f":"of:=DATE([Calcoli.E92];[Calcoli.E91];[Calcoli.E90])","v":"2017-01-12"},null,"Data_GD LP",{"$f":"of:=DATE([Calcoli.H92];[Calcoli.H91];[Calcoli.H90])","v":"2017-02-11"},null,"Data_GD LP",{"$f":"of:=DATE([Calcoli.K92];[Calcoli.K91];[Calcoli.K90])","v":"2017-03-12"},null,"Data_GD LP",{"$f":"of:=DATE([Calcoli.N92];[Calcoli.N91];[Calcoli.N90])","v":"2017-04-11"},null,"Data_GD LP",{"$f":"of:=DATE([Calcoli.Q92];[Calcoli.Q91];[Calcoli.Q90])","v":"2017-05-10"},null,"Data_GD LP",{"$f":"of:=DATE([Calcoli.T92];[Calcoli.T91];[Calcoli.T90])","v":"2017-06-09"},null,"Data_GD LP",{"$f":"of:=DATE([Calcoli.W92];[Calcoli.W91];[Calcoli.W90])","v":"2017-07-09"},null,"Data_GD LP",{"$f":"of:=DATE([Calcoli.Z92];[Calcoli.Z91];[Calcoli.Z90])","v":"2017-08-07"},null,"Data_GD LP",{"$f":"of:=DATE([Calcoli.AC92];[Calcoli.AC91];[Calcoli.AC90])","v":"2017-09-06"},null,"Data_GD LP",{"$f":"of:=DATE([Calcoli.AF92];[Calcoli.AF91];[Calcoli.AF90])","v":"2017-10-05"},null,"Data_GD LP",{"$f":"of:=DATE([Calcoli.AI92];[Calcoli.AI91];[Calcoli.AI90])","v":"2017-11-04"},null,"Data_GD LP",{"$f":"of:=DATE([Calcoli.AL92];[Calcoli.AL91];[Calcoli.AL90])","v":"2017-12-03"},null,"Data_GD LP",{"$f":"of:=DATE([Calcoli.AO92];[Calcoli.AO91];[Calcoli.AO90])","v":"2018-01-31"}]
["Ore_GD LP",{"$f":"of:=INT(([Calcoli.B90]-INT([Calcoli.B90]))*24)+1","v":1},null,"Ore_GD LP",{"$f":"of:=INT(([Calcoli.E90]-INT([Calcoli.E90]))*24)+1","v":12},null,"Ore_GD LP",{"$f":"of:=INT(([Calcoli.H90]-INT([Calcoli.H90]))*24)+1","v":1},null,"Ore_GD LP",{"$f":"of:=INT(([Calcoli.K90]-INT([Calcoli.K90]))*24)+1","v":15},null,"Ore_GD LP",{"$f":"of:=INT(([Calcoli.N90]-INT([Calcoli.N90]))*24)+1","v":7},null,"Ore_GD LP",{"$f":"of:=INT(([Calcoli.Q90]-INT([Calcoli.Q90]))*24)+1","v":22},null,"Ore_GD LP",{"$f":"of:=INT(([Calcoli.T90]-INT([Calcoli.T90]))*24)+1","v":14},null,"Ore_GD LP",{"$f":"of:=INT(([Calcoli.W90]-INT([Calcoli.W90]))*24)+1","v":5},null,"Ore_GD LP",{"$f":"of:=INT(([Calcoli.Z90]-INT([Calcoli.Z90]))*24)+1","v":19},null,"Ore_GD LP",{"$f":"of:=INT(([Calcoli.AC90]-INT([Calcoli.AC90]))*24)+1","v":8},null,"Ore_GD LP",{"$f":"of:=INT(([Calcoli.AF90]-INT([Calcoli.AF90]))*24)+1","v":19},null,"Ore_GD LP",{"$f":"of:=INT(([Calcoli.AI90]-INT([Calcoli.AI90]))*24)+1","v":6},null,"Ore_GD LP",{"$f":"of:=INT(([Calcoli.AL90]-INT([Calcoli.AL90]))*24)+1","v":16},null,"Ore_GD LP",{"$f":"of:=INT(([Calcoli.AO90]-INT([Calcoli.AO90]))*24)+1","v":14}]
["Minuti_GD LP",{"$f":"of:=INT((([Calcoli.B90]-INT([Calcoli.B90]))*24-([Calcoli.B94]-1))*60)","v":6},null,"Minuti_GD LP",{"$f":"of:=INT((([Calcoli.E90]-INT([Calcoli.E90]))*24-([Calcoli.E94]-1))*60)","v":35},null,"Minuti_GD LP",{"$f":"of:=INT((([Calcoli.H90]-INT([Calcoli.H90]))*24-([Calcoli.H94]-1))*60)","v":34},null,"Minuti_GD LP",{"$f":"of:=INT((([Calcoli.K90]-INT([Calcoli.K90]))*24-([Calcoli.K94]-1))*60)","v":54},null,"Minuti_GD LP",{"$f":"of:=INT((([Calcoli.N90]-INT([Calcoli.N90]))*24-([Calcoli.N94]-1))*60)","v":9},null,"Minuti_GD LP",{"$f":"of:=INT((([Calcoli.Q90]-INT([Calcoli.Q90]))*24-([Calcoli.Q94]-1))*60)","v":44},null,"Minuti_GD LP",{"$f":"of:=INT((([Calcoli.T90]-INT([Calcoli.T90]))*24-([Calcoli.T94]-1))*60)","v":11},null,"Minuti_GD LP",{"$f":"of:=INT((([Calcoli.W90]-INT([Calcoli.W90]))*24-([Calcoli.W94]-1))*60)","v":8},null,"Minuti_GD LP",{"$f":"of:=INT((([Calcoli.Z90]-INT([Calcoli.Z90]))*24-([Calcoli.Z94]-1))*60)","v":13},null,"Minuti_GD LP",{"$f":"of:=INT((([Calcoli.AC90]-INT([Calcoli.AC90]))*24-([Calcoli.AC94]-1))*60)","v":5},null,"Minuti_GD LP",{"$f":"of:=INT((([Calcoli.AF90]-INT([Calcoli.AF90]))*24-([Calcoli.AF94]-1))*60)","v":42},null,"Minuti_GD LP",{"$f":"of:=INT((([Calcoli.AI90]-INT([Calcoli.AI90]))*24-([Calcoli.AI94]-1))*60)","v":25},null,"Minuti_GD LP",{"$f":"of:=INT((([Calcoli.AL90]-INT([Calcoli.AL90]))*24-([Calcoli.AL94]-1))*60)","v":49},null,"Minuti_GD LP",{"$f":"of:=INT((([Calcoli.AO90]-INT([Calcoli.AO90]))*24-([Calcoli.AO94]-1))*60)","v":28}]
["Secondi_GD LP",{"$f":"of:=INT((((([Calcoli.B90]-INT([Calcoli.B90]))*24-([Calcoli.B94]-1))*60)-[Calcoli.B95])*60)","v":54},null,"Secondi_GD LP",{"$f":"of:=INT((((([Calcoli.E90]-INT([Calcoli.E90]))*24-([Calcoli.E94]-1))*60)-[Calcoli.E95])*60)","v":13},null,"Secondi_GD LP",{"$f":"of:=INT((((([Calcoli.H90]-INT([Calcoli.H90]))*24-([Calcoli.H94]-1))*60)-[Calcoli.H95])*60)-60","v":-53},null,"Secondi_GD LP",{"$f":"of:=INT((((([Calcoli.K90]-INT([Calcoli.K90]))*24-([Calcoli.K94]-1))*60)-[Calcoli.K95])*60)","v":57},null,"Secondi_GD LP",{"$f":"of:=INT((((([Calcoli.N90]-INT([Calcoli.N90]))*24-([Calcoli.N94]-1))*60)-[Calcoli.N95])*60)","v":30},null,"Secondi_GD LP",{"$f":"of:=INT((((([Calcoli.Q90]-INT([Calcoli.Q90]))*24-([Calcoli.Q94]-1))*60)-[Calcoli.Q95])*60)","v":12},null,"Secondi_GD LP",{"$f":"of:=INT((((([Calcoli.T90]-INT([Calcoli.T90]))*24-([Calcoli.T94]-1))*60)-[Calcoli.T95])*60)","v":34},null,"Secondi_GD LP",{"$f":"of:=INT((((([Calcoli.W90]-INT([Calcoli.W90]))*24-([Calcoli.W94]-1))*60)-[Calcoli.W95])*60)","v":49},null,"Secondi_GD LP",{"$f":"of:=INT((((([Calcoli.Z90]-INT([Calcoli.Z90]))*24-([Calcoli.Z94]-1))*60)-[Calcoli.Z95])*60)","v":14},null,"Secondi_GD LP",{"$f":"of:=INT((((([Calcoli.AC90]-INT([Calcoli.AC90]))*24-([Calcoli.AC94]-1))*60)-[Calcoli.AC95])*60)","v":22},null,"Secondi_GD LP",{"$f":"of:=INT((((([Calcoli.AF90]-INT([Calcoli.AF90]))*24-([Calcoli.AF94]-1))*60)-[Calcoli.AF95])*60)","v":20},null,"Secondi_GD LP",{"$f":"of:=INT((((([Calcoli.AI90]-INT([Calcoli.AI90]))*24-([Calcoli.AI94]-1))*60)-[Calcoli.AI95])*60)","v":0},null,"Secondi_GD LP",{"$f":"of:=INT((((([Calcoli.AL90]-INT([Calcoli.AL90]))*24-([Calcoli.AL94]-1))*60)-[Calcoli.AL95])*60)","v":6},null,"Secondi_GD LP",{"$f":"of:=INT((((([Calcoli.AO90]-INT([Calcoli.AO90]))*24-([Calcoli.AO94]-1))*60)-[Calcoli.AO95])*60)","v":24}]
["JD_Data UQ",{"$f":"of:=[Calcoli.B41]","v":2457743.5834},null,"JD_Data UQ",{"$f":"of:=[Calcoli.E41]","v":2457773.4288},null,"JD_Data UQ",{"$f":"of:=[Calcoli.H41]","v":2457803.3184},null,"JD_Data UQ",{"$f":"of:=[Calcoli.K41]","v":2457833.1702},null,"JD_Data UQ",{"$f":"of:=[Calcoli.N41]","v":2457862.9196},null,"JD_Data UQ",{"$f":"of:=[Calcoli.Q41]","v":2457892.5279},null,"JD_Data UQ",{"$f":"of:=[Calcoli.T41]","v":2457921.9861},null,"JD_Data UQ",{"$f":"of:=[Calcoli.W41]","v":2457951.3144},null,"JD_Data UQ",{"$f":"of:=[Calcoli.Z41]","v":2457980.5571},null,"JD_Data UQ",{"$f":"of:=[Calcoli.AC41]","v":2458009.7721},null,"JD_Data UQ",{"$f":"of:=[Calcoli.AF41]","v":2458039.0223},null,"JD_Data UQ",{"$f":"of:=[Calcoli.AI41]","v":2458068.3631},null,"JD_Data UQ",{"$f":"of:=[Calcoli.AL41]","v":2458097.8314},null,"JD_Data UQ",{"$f":"of:=[Calcoli.AO41]","v":2458157.1665}]
["Z4",{"$f":"of:=INT([Calcoli.B97]+0.5)","v":2457744},null,"Z4",{"$f":"of:=INT([Calcoli.E97]+0.5)","v":2457773},null,"Z4",{"$f":"of:=INT([Calcoli.H97]+0.5)","v":2457803},null,"Z4",{"$f":"of:=INT([Calcoli.K97]+0.5)","v":2457833},null,"Z4",{"$f":"of:=INT([Calcoli.N97]+0.5)","v":2457863},null,"Z4",{"$f":"of:=INT([Calcoli.Q97]+0.5)","v":2457893},null,"Z4",{"$f":"of:=INT([Calcoli.T97]+0.5)","v":2457922},null,"Z4",{"$f":"of:=INT([Calcoli.W97]+0.5)","v":2457951},null,"Z4",{"$f":"of:=INT([Calcoli.Z97]+0.5)","v":2457981},null,"Z4",{"$f":"of:=INT([Calcoli.AC97]+0.5)","v":2458010},null,"Z4",{"$f":"of:=INT([Calcoli.AF97]+0.5)","v":2458039},null,"Z4",{"$f":"of:=INT([Calcoli.AI97]+0.5)","v":2458068},null,"Z4",{"$f":"of:=INT([Calcoli.AL97]+0.5)","v":2458098},null,"Z4",{"$f":"of:=INT([Calcoli.AO97]+0.5)","v":2458157}]
["F4",{"$f":"of:=[Calcoli.B97]+0.5-INT([Calcoli.B97]+0.5)","v":0.0833999998867512},null,"F4",{"$f":"of:=[Calcoli.E97]+0.5-INT([Calcoli.E97]+0.5)","v":0.928799999877811},null,"F4",{"$f":"of:=[Calcoli.H97]+0.5-INT([Calcoli.H97]+0.5)","v":0.818400000222027},null,"F4",{"$f":"of:=[Calcoli.K97]+0.5-INT([Calcoli.K97]+0.5)","v":0.670200000051409},null,"F4",{"$f":"of:=[Calcoli.N97]+0.5-INT([Calcoli.N97]+0.5)","v":0.419600000139326},null,"F4",{"$f":"of:=[Calcoli.Q97]+0.5-INT([Calcoli.Q97]+0.5)","v":0.027900000102818},null,"F4",{"$f":"of:=[Calcoli.T97]+0.5-INT([Calcoli.T97]+0.5)","v":0.486099999863654},null,"F4",{"$f":"of:=[Calcoli.W97]+0.5-INT([Calcoli.W97]+0.5)","v":0.814400000032038},null,"F4",{"$f":"of:=[Calcoli.Z97]+0.5-INT([Calcoli.Z97]+0.5)","v":0.0570999998599291},null,"F4",{"$f":"of:=[Calcoli.AC97]+0.5-INT([Calcoli.AC97]+0.5)","v":0.272100000176579},null,"F4",{"$f":"of:=[Calcoli.AF97]+0.5-INT([Calcoli.AF97]+0.5)","v":0.522299999836832},null,"F4",{"$f":"of:=[Calcoli.AI97]+0.5-INT([Calcoli.AI97]+0.5)","v":0.86310000019148},null,"F4",{"$f":"of:=[Calcoli.AL97]+0.5-INT([Calcoli.AL97]+0.5)","v":0.331400000024587},null,"F4",{"$f":"of:=[Calcoli.AO97]+0.5-INT([Calcoli.AO97]+0.5)","v":0.666499999817461}]
["Ω4",{"$f":"of:=INT(([Calcoli.B98]-1867216.25)/36524.25)","v":16},null,"Ω4",{"$f":"of:=INT(([Calcoli.E98]-1867216.25)/36524.25)","v":16},null,"Ω4",{"$f":"of:=INT(([Calcoli.H98]-1867216.25)/36524.25)","v":16},null,"Ω4",{"$f":"of:=INT(([Calcoli.K98]-1867216.25)/36524.25)","v":16},null,"Ω4",{"$f":"of:=INT(([Calcoli.N98]-1867216.25)/36524.25)","v":16},null,"Ω4",{"$f":"of:=INT(([Calcoli.Q98]-1867216.25)/36524.25)","v":16},null,"Ω4",{"$f":"of:=INT(([Calcoli.T98]-1867216.25)/36524.25)","v":16},null,"Ω4",{"$f":"of:=INT(([Calcoli.W98]-1867216.25)/36524.25)","v":16},null,"Ω4",{"$f":"of:=INT(([Calcoli.Z98]-1867216.25)/36524.25)","v":16},null,"Ω4",{"$f":"of:=INT(([Calcoli.AC98]-1867216.25)/36524.25)","v":16},null,"Ω4",{"$f":"of:=INT(([Calcoli.AF98]-1867216.25)/36524.25)","v":16},null,"Ω4",{"$f":"of:=INT(([Calcoli.AI98]-1867216.25)/36524.25)","v":16},null,"Ω4",{"$f":"of:=INT(([Calcoli.AL98]-1867216.25)/36524.25)","v":16},null,"Ω4",{"$f":"of:=INT(([Calcoli.AO98]-1867216.25)/36524.25)","v":16}]
["A4",{"$f":"of:=IF([Calcoli.B98]<2299161;[Calcoli.B98];[Calcoli.B98]+1+[Calcoli.B100]-INT([Calcoli.B100]/4))","v":2457757},null,"A4",{"$f":"of:=IF([Calcoli.E98]<2299161;[Calcoli.E98];[Calcoli.E98]+1+[Calcoli.E100]-INT([Calcoli.E100]/4))","v":2457786},null,"A4",{"$f":"of:=IF([Calcoli.H98]<2299161;[Calcoli.H98];[Calcoli.H98]+1+[Calcoli.H100]-INT([Calcoli.H100]/4))","v":2457816},null,"A4",{"$f":"of:=IF([Calcoli.K98]<2299161;[Calcoli.K98];[Calcoli.K98]+1+[Calcoli.K100]-INT([Calcoli.K100]/4))","v":2457846},null,"A4",{"$f":"of:=IF([Calcoli.N98]<2299161;[Calcoli.N98];[Calcoli.N98]+1+[Calcoli.N100]-INT([Calcoli.N100]/4))","v":2457876},null,"A4",{"$f":"of:=IF([Calcoli.Q98]<2299161;[Calcoli.Q98];[Calcoli.Q98]+1+[Calcoli.Q100]-INT([Calcoli.Q100]/4))","v":2457906},null,"A4",{"$f":"of:=IF([Calcoli.T98]<2299161;[Calcoli.T98];[Calcoli.T98]+1+[Calcoli.T100]-INT([Calcoli.T100]/4))","v":2457935},null,"A4",{"$f":"of:=IF([Calcoli.W98]<2299161;[Calcoli.W98];[Calcoli.W98]+1+[Calcoli.W100]-INT([Calcoli.W100]/4))","v":2457964},null,"A4",{"$f":"of:=IF([Calcoli.Z98]<2299161;[Calcoli.Z98];[Calcoli.Z98]+1+[Calcoli.Z100]-INT([Calcoli.Z100]/4))","v":2457994},null,"A4",{"$f":"of:=IF([Calcoli.AC98]<2299161;[Calcoli.AC98];[Calcoli.AC98]+1+[Calcoli.AC100]-INT([Calcoli.AC100]/4))","v":2458023},null,"A4",{"$f":"of:=IF([Calcoli.AF98]<2299161;[Calcoli.AF98];[Calcoli.AF98]+1+[Calcoli.AF100]-INT([Calcoli.AF100]/4))","v":2458052},null,"A4",{"$f":"of:=IF([Calcoli.AI98]<2299161;[Calcoli.AI98];[Calcoli.AI98]+1+[Calcoli.AI100]-INT([Calcoli.AI100]/4))","v":2458081},null,"A4",{"$f":"of:=IF([Calcoli.AL98]<2299161;[Calcoli.AL98];[Calcoli.AL98]+1+[Calcoli.AL100]-INT([Calcoli.AL100]/4))","v":2458111},null,"A4",{"$f":"of:=IF([Calcoli.AO98]<2299161;[Calcoli.AO98];[Calcoli.AO98]+1+[Calcoli.AO100]-INT([Calcoli.AO100]/4))","v":2458170}]
["B4",{"$f":"of:=[Calcoli.B101]+1524","v":2459281},null,"B4",{"$f":"of:=[Calcoli.E101]+1524","v":2459310},null,"B4",{"$f":"of:=[Calcoli.H101]+1524","v":2459340},null,"B4",{"$f":"of:=[Calcoli.K101]+1524","v":2459370},null,"B4",{"$f":"of:=[Calcoli.N101]+1524","v":2459400},null,"B4",{"$f":"of:=[Calcoli.Q101]+1524","v":2459430},null,"B4",{"$f":"of:=[Calcoli.T101]+1524","v":2459459},null,"B4",{"$f":"of:=[Calcoli.W101]+1524","v":2459488},null,"B4",{"$f":"of:=[Calcoli.Z101]+1524","v":2459518},null,"B4",{"$f":"of:=[Calcoli.AC101]+1524","v":2459547},null,"B4",{"$f":"of:=[Calcoli.AF101]+1524","v":2459576},null,"B4",{"$f":"of:=[Calcoli.AI101]+1524","v":2459605},null,"B4",{"$f":"of:=[Calcoli.AL101]+1524","v":2459635},null,"B4",{"$f":"of:=[Calcoli.AO101]+1524","v":2459694}]
["C4",{"$f":"of:=INT(([Calcoli.B102]-122.1)/365.25)","v":6732},null,"C4",{"$f":"of:=INT(([Calcoli.E102]-122.1)/365.25)","v":6732},null,"C4",{"$f":"of:=INT(([Calcoli.H102]-122.1)/365.25)","v":6732},null,"C4",{"$f":"of:=INT(([Calcoli.K102]-122.1)/365.25)","v":6733},null,"C4",{"$f":"of:=INT(([Calcoli.N102]-122.1)/365.25)","v":6733},null,"C4",{"$f":"of:=INT(([Calcoli.Q102]-122.1)/365.25)","v":6733},null,"C4",{"$f":"of:=INT(([Calcoli.T102]-122.1)/365.25)","v":6733},null,"C4",{"$f":"of:=INT(([Calcoli.W102]-122.1)/365.25)","v":6733},null,"C4",{"$f":"of:=INT(([Calcoli.Z102]-122.1)/365.25)","v":6733},null,"C4",{"$f":"of:=INT(([Calcoli.AC102]-122.1)/365.25)","v":6733},null,"C4",{"$f":"of:=INT(([Calcoli.AF102]-122.1)/365.25)","v":6733},null,"C4",{"$f":"of:=INT(([Calcoli.AI102]-122.1)/365.25)","v":6733},null,"C4",{"$f":"of:=INT(([Calcoli.AL102]-122.1)/365.25)","v":6733},null,"C4",{"$f":"of:=INT(([Calcoli.AO102]-122.1)/365.25)","v":6733}]
["D4",{"$f":"of:=INT(365.25*[Calcoli.B103])","v":2458863},null,"D4",{"$f":"of:=INT(365.25*[Calcoli.E103])","v":2458863},null,"D4",{"$f":"of:=INT(365.25*[Calcoli.H103])","v":2458863},null,"D4",{"$f":"of:=INT(365.25*[Calcoli.K103])","v":2459228},null,"D4",{"$f":"of:=INT(365.25*[Calcoli.N103])","v":2459228},null,"D4",{"$f":"of:=INT(365.25*[Calcoli.Q103])","v":2459228},null,"D4",{"$f":"of:=INT(365.25*[Calcoli.T103])","v":2459228},null,"D4",{"$f":"of:=INT(365.25*[Calcoli.W103])","v":2459228},null,"D4",{"$f":"of:=INT(365.25*[Calcoli.Z103])","v":2459228},null,"D4",{"$f":"of:=INT(365.25*[Calcoli.AC103])","v":2459228},null,"D4",{"$f":"of:=INT(365.25*[Calcoli.AF103])","v":2459228},null,"D4",{"$f":"of:=INT(365.25*[Calcoli.AI103])","v":2459228},null,"D4",{"$f":"of:=INT(365.25*[Calcoli.AL103])","v":2459228},null,"D4",{"$f":"of:=INT(365.25*[Calcoli.AO103])","v":2459228}]
["E4",{"$f":"of:=INT(([Calcoli.B102]-[Calcoli.B104])/30.6001)","v":13},null,"E4",{"$f":"of:=INT(([Calcoli.E102]-[Calcoli.E104])/30.6001)","v":14},null,"E4",{"$f":"of:=INT(([Calcoli.H102]-[Calcoli.H104])/30.6001)","v":15},null,"E4",{"$f":"of:=INT(([Calcoli.K102]-[Calcoli.K104])/30.6001)","v":4},null,"E4",{"$f":"of:=INT(([Calcoli.N102]-[Calcoli.N104])/30.6001)","v":5},null,"E4",{"$f":"of:=INT(([Calcoli.Q102]-[Calcoli.Q104])/30.6001)","v":6},null,"E4",{"$f":"of:=INT(([Calcoli.T102]-[Calcoli.T104])/30.6001)","v":7},null,"E4",{"$f":"of:=INT(([Calcoli.W102]-[Calcoli.W104])/30.6001)","v":8},null,"E4",{"$f":"of:=INT(([Calcoli.Z102]-[Calcoli.Z104])/30.6001)","v":9},null,"E4",{"$f":"of:=INT(([Calcoli.AC102]-[Calcoli.AC104])/30.6001)","v":10},null,"E4",{"$f":"of:=INT(([Calcoli.AF102]-[Calcoli.AF104])/30.6001)","v":11},null,"E4",{"$f":"of:=INT(([Calcoli.AI102]-[Calcoli.AI104])/30.6001)","v":12},null,"E4",{"$f":"of:=INT(([Calcoli.AL102]-[Calcoli.AL104])/30.6001)","v":13},null,"E4",{"$f":"of:=INT(([Calcoli.AO102]-[Calcoli.AO104])/30.6001)","v":15}]
["Giorno_UQ",{"$f":"of:=ROUND([Calcoli.B102]-[Calcoli.B104]-INT(30.6001*[Calcoli.B105])+[Calcoli.B99];4)","v":21.0834},null,"Giorno_UQ",{"$f":"of:=ROUND([Calcoli.E102]-[Calcoli.E104]-INT(30.6001*[Calcoli.E105])+[Calcoli.E99];4)","v":19.9288},null,"Giorno_UQ",{"$f":"of:=ROUND([Calcoli.H102]-[Calcoli.H104]-INT(30.6001*[Calcoli.H105])+[Calcoli.H99];4)","v":18.8184},null,"Giorno_UQ",{"$f":"of:=ROUND([Calcoli.K102]-[Calcoli.K104]-INT(30.6001*[Calcoli.K105])+[Calcoli.K99];4)","v":20.6702},null,"Giorno_UQ",{"$f":"of:=ROUND([Calcoli.N102]-[Calcoli.N104]-INT(30.6001*[Calcoli.N105])+[Calcoli.N99];4)","v":19.4196},null,"Giorno_UQ",{"$f":"of:=ROUND([Calcoli.Q102]-[Calcoli.Q104]-INT(30.6001*[Calcoli.Q105])+[Calcoli.Q99];4)","v":19.0279},null,"Giorno_UQ",{"$f":"of:=ROUND([Calcoli.T102]-[Calcoli.T104]-INT(30.6001*[Calcoli.T105])+[Calcoli.T99];4)","v":17.4861},null,"Giorno_UQ",{"$f":"of:=ROUND([Calcoli.W102]-[Calcoli.W104]-INT(30.6001*[Calcoli.W105])+[Calcoli.W99];4)","v":16.8144},null,"Giorno_UQ",{"$f":"of:=ROUND([Calcoli.Z102]-[Calcoli.Z104]-INT(30.6001*[Calcoli.Z105])+[Calcoli.Z99];4)","v":15.0571},null,"Giorno_UQ",{"$f":"of:=ROUND([Calcoli.AC102]-[Calcoli.AC104]-INT(30.6001*[Calcoli.AC105])+[Calcoli.AC99];4)","v":13.2721},null,"Giorno_UQ",{"$f":"of:=ROUND([Calcoli.AF102]-[Calcoli.AF104]-INT(30.6001*[Calcoli.AF105])+[Calcoli.AF99];4)","v":12.5223},null,"Giorno_UQ",{"$f":"of:=ROUND([Calcoli.AI102]-[Calcoli.AI104]-INT(30.6001*[Calcoli.AI105])+[Calcoli.AI99];4)","v":10.8631},null,"Giorno_UQ",{"$f":"of:=ROUND([Calcoli.AL102]-[Calcoli.AL104]-INT(30.6001*[Calcoli.AL105])+[Calcoli.AL99];4)","v":10.3314},null,"Giorno_UQ",{"$f":"of:=ROUND([Calcoli.AO102]-[Calcoli.AO104]-INT(30.6001*[Calcoli.AO105])+[Calcoli.AO99];4)","v":7.6665}]
["Mese_UQ",{"$f":"of:=IF([Calcoli.B105]<13.5;[Calcoli.B105]-1;[Calcoli.B105]-13)","v":12},null,"Mese_UQ",{"$f":"of:=IF([Calcoli.E105]<13.5;[Calcoli.E105]-1;[Calcoli.E105]-13)","v":1},null,"Mese_UQ",{"$f":"of:=IF([Calcoli.H105]<13.5;[Calcoli.H105]-1;[Calcoli.H105]-13)","v":2},null,"Mese_UQ",{"$f":"of:=IF([Calcoli.K105]<13.5;[Calcoli.K105]-1;[Calcoli.K105]-13)","v":3},null,"Mese_UQ",{"$f":"of:=IF([Calcoli.N105]<13.5;[Calcoli.N105]-1;[Calcoli.N105]-13)","v":4},null,"Mese_UQ",{"$f":"of:=IF([Calcoli.Q105]<13.5;[Calcoli.Q105]-1;[Calcoli.Q105]-13)","v":5},null,"Mese_UQ",{"$f":"of:=IF([Calcoli.T105]<13.5;[Calcoli.T105]-1;[Calcoli.T105]-13)","v":6},null,"Mese_UQ",{"$f":"of:=IF([Calcoli.W105]<13.5;[Calcoli.W105]-1;[Calcoli.W105]-13)","v":7},null,"Mese_UQ",{"$f":"of:=IF([Calcoli.Z105]<13.5;[Calcoli.Z105]-1;[Calcoli.Z105]-13)","v":8},null,"Mese_UQ",{"$f":"of:=IF([Calcoli.AC105]<13.5;[Calcoli.AC105]-1;[Calcoli.AC105]-13)","v":9},null,"Mese_UQ",{"$f":"of:=IF([Calcoli.AF105]<13.5;[Calcoli.AF105]-1;[Calcoli.AF105]-13)","v":10},null,"Mese_UQ",{"$f":"of:=IF([Calcoli.AI105]<13.5;[Calcoli.AI105]-1;[Calcoli.AI105]-13)","v":11},null,"Mese_UQ",{"$f":"of:=IF([Calcoli.AL105]<13.5;[Calcoli.AL105]-1;[Calcoli.AL105]-13)","v":12},null,"Mese_UQ",{"$f":"of:=IF([Calcoli.AO105]<13.5;[Calcoli.AO105]-1;[Calcoli.AO105]-13)","v":2}]
["ANNO_UQ",{"$f":"of:=IF([Calcoli.B107]>2.5 AND([Calcoli.B107]<12.5);[Calcoli.B103]-4716;[Calcoli.B103]-4715)","v":2016},null,"ANNO_UQ",{"$f":"of:=IF([Calcoli.E107]>2.5 AND([Calcoli.E107]<12.5);[Calcoli.E103]-4716;[Calcoli.E103]-4715)","v":2017},null,"ANNO_UQ",{"$f":"of:=IF([Calcoli.H107]>2.5 AND([Calcoli.H107]<12.5);[Calcoli.H103]-4716;[Calcoli.H103]-4715)","v":2017},null,"ANNO_UQ",{"$f":"of:=IF([Calcoli.K107]>2.5 AND([Calcoli.K107]<12.5);[Calcoli.K103]-4716;[Calcoli.K103]-4715)","v":2017},null,"ANNO_UQ",{"$f":"of:=IF([Calcoli.N107]>2.5 AND([Calcoli.N107]<12.5);[Calcoli.N103]-4716;[Calcoli.N103]-4715)","v":2017},null,"ANNO_UQ",{"$f":"of:=IF([Calcoli.Q107]>2.5 AND([Calcoli.Q107]<12.5);[Calcoli.Q103]-4716;[Calcoli.Q103]-4715)","v":2017},null,"ANNO_UQ",{"$f":"of:=IF([Calcoli.T107]>2.5 AND([Calcoli.T107]<12.5);[Calcoli.T103]-4716;[Calcoli.T103]-4715)","v":2017},null,"ANNO_UQ",{"$f":"of:=IF([Calcoli.W107]>2.5 AND([Calcoli.W107]<12.5);[Calcoli.W103]-4716;[Calcoli.W103]-4715)","v":2017},null,"ANNO_UQ",{"$f":"of:=IF([Calcoli.Z107]>2.5 AND([Calcoli.Z107]<12.5);[Calcoli.Z103]-4716;[Calcoli.Z103]-4715)","v":2017},null,"ANNO_UQ",{"$f":"of:=IF([Calcoli.AC107]>2.5 AND([Calcoli.AC107]<12.5);[Calcoli.AC103]-4716;[Calcoli.AC103]-4715)","v":2017},null,"ANNO_UQ",{"$f":"of:=IF([Calcoli.AF107]>2.5 AND([Calcoli.AF107]<12.5);[Calcoli.AF103]-4716;[Calcoli.AF103]-4715)","v":2017},null,"ANNO_UQ",{"$f":"of:=IF([Calcoli.AI107]>2.5 AND([Calcoli.AI107]<12.5);[Calcoli.AI103]-4716;[Calcoli.AI103]-4715)","v":2017},null,"ANNO_UQ",{"$f":"of:=IF([Calcoli.AL107]>2.5 AND([Calcoli.AL107]<12.5);[Calcoli.AL103]-4716;[Calcoli.AL103]-4715)","v":2017},null,"ANNO_UQ",{"$f":"of:=IF([Calcoli.AO107]>2.5 AND([Calcoli.AO107]<12.5);[Calcoli.AO103]-4716;[Calcoli.AO103]-4715)","v":2018}]
["Data_GD UQ",{"$f":"of:=DATE([Calcoli.B108];[Calcoli.B107];[Calcoli.B106])","v":"2016-12-21"},null,"Data_GD UQ",{"$f":"of:=DATE([Calcoli.E108];[Calcoli.E107];[Calcoli.E106])","v":"2017-01-19"},null,"Data_GD UQ",{"$f":"of:=DATE([Calcoli.H108];[Calcoli.H107];[Calcoli.H106])","v":"2017-02-18"},null,"Data_GD UQ",{"$f":"of:=DATE([Calcoli.K108];[Calcoli.K107];[Calcoli.K106])","v":"2017-03-20"},null,"Data_GD UQ",{"$f":"of:=DATE([Calcoli.N108];[Calcoli.N107];[Calcoli.N106])","v":"2017-04-19"},null,"Data_GD UQ",{"$f":"of:=DATE([Calcoli.Q108];[Calcoli.Q107];[Calcoli.Q106])","v":"2017-05-19"},null,"Data_GD UQ",{"$f":"of:=DATE([Calcoli.T108];[Calcoli.T107];[Calcoli.T106])","v":"2017-06-17"},null,"Data_GD UQ",{"$f":"of:=DATE([Calcoli.W108];[Calcoli.W107];[Calcoli.W106])","v":"2017-07-16"},null,"Data_GD UQ",{"$f":"of:=DATE([Calcoli.Z108];[Calcoli.Z107];[Calcoli.Z106])","v":"2017-08-15"},null,"Data_GD UQ",{"$f":"of:=DATE([Calcoli.AC108];[Calcoli.AC107];[Calcoli.AC106])","v":"2017-09-13"},null,"Data_GD UQ",{"$f":"of:=DATE([Calcoli.AF108];[Calcoli.AF107];[Calcoli.AF106])","v":"2017-10-12"},null,"Data_GD UQ",{"$f":"of:=DATE([Calcoli.AI108];[Calcoli.AI107];[Calcoli.AI106])","v":"2017-11-10"},null,"Data_GD UQ",{"$f":"of:=DATE([Calcoli.AL108];[Calcoli.AL107];[Calcoli.AL106])","v":"2017-12-10"},null,"Data_GD UQ",{"$f":"of:=DATE([Calcoli.AO108];[Calcoli.AO107];[Calcoli.AO106])","v":"2018-02-07"}]
["Ore_GD UQ",{"$f":"of:=INT(([Calcoli.B106]-INT([Calcoli.B106]))*24)+1","v":3},null,"Ore_GD UQ",{"$f":"of:=INT(([Calcoli.E106]-INT([Calcoli.E106]))*24)+1","v":23},null,"Ore_GD UQ",{"$f":"of:=INT(([Calcoli.H106]-INT([Calcoli.H106]))*24)+1","v":20},null,"Ore_GD UQ",{"$f":"of:=INT(([Calcoli.K106]-INT([Calcoli.K106]))*24)+1","v":17},null,"Ore_GD UQ",{"$f":"of:=INT(([Calcoli.N106]-INT([Calcoli.N106]))*24)+1","v":11},null,"Ore_GD UQ",{"$f":"of:=INT(([Calcoli.Q106]-INT([Calcoli.Q106]))*24)+1","v":1},null,"Ore_GD UQ",{"$f":"of:=INT(([Calcoli.T106]-INT([Calcoli.T106]))*24)+1","v":12},null,"Ore_GD UQ",{"$f":"of:=INT(([Calcoli.W106]-INT([Calcoli.W106]))*24)+1","v":20},null,"Ore_GD UQ",{"$f":"of:=INT(([Calcoli.Z106]-INT([Calcoli.Z106]))*24)+1","v":2},null,"Ore_GD UQ",{"$f":"of:=INT(([Calcoli.AC106]-INT([Calcoli.AC106]))*24)+1","v":7},null,"Ore_GD UQ",{"$f":"of:=INT(([Calcoli.AF106]-INT([Calcoli.AF106]))*24)+1","v":13},null,"Ore_GD UQ",{"$f":"of:=INT(([Calcoli.AI106]-INT([Calcoli.AI106]))*24)+1","v":21},null,"Ore_GD UQ",{"$f":"of:=INT(([Calcoli.AL106]-INT([Calcoli.AL106]))*24)+1","v":8},null,"Ore_GD UQ",{"$f":"of:=INT(([Calcoli.AO106]-INT([Calcoli.AO106]))*24)+1","v":16}]
["Minuti_GD UQ",{"$f":"of:=IF(INT((([Calcoli.B106]-INT([Calcoli.B106]))*24-([Calcoli.B110]-1))*60)-4>=0;INT((([Calcoli.B106]-INT([Calcoli.B106]))*24-([Calcoli.B110]-1))*60)-4;INT((([Calcoli.B106]-INT([Calcoli.B106]))*24-([Calcoli.B110]-1))*60))","v":0},null,"Minuti_GD UQ",{"$f":"of:=INT((([Calcoli.E106]-INT([Calcoli.E106]))*24-([Calcoli.E110]-1))*60)","v":17},null,"Minuti_GD UQ",{"$f":"of:=IF(INT((([Calcoli.H106]-INT([Calcoli.H106]))*24-([Calcoli.H110]-1))*60)-4>=0;INT((([Calcoli.H106]-INT([Calcoli.H106]))*24-([Calcoli.H110]-1))*60)-4;INT((([Calcoli.H106]-INT([Calcoli.H106]))*24-([Calcoli.H110]-1))*60))-4","v":30},null,"Minuti_GD UQ",{"$f":"of:=IF(INT((([Calcoli.K106]-INT([Calcoli.K106]))*24-([Calcoli.K110]-1))*60)-4>=0;INT((([Calcoli.K106]-INT([Calcoli.K106]))*24-([Calcoli.K110]-1))*60)-4;INT((([Calcoli.K106]-INT([Calcoli.K106]))*24-([Calcoli.K110]-1))*60))","v":1},null,"Minuti_GD UQ",{"$f":"of:=IF(INT((([Calcoli.N106]-INT([Calcoli.N106]))*24-([Calcoli.N110]-1))*60)-4>=0;INT((([Calcoli.N106]-INT([Calcoli.N106]))*24-([Calcoli.N110]-1))*60)-4;INT((([Calcoli.N106]-INT([Calcoli.N106]))*24-([Calcoli.N110]-1))*60))","v":0},null,"Minuti_GD UQ",{"$f":"of:=IF(INT((([Calcoli.Q106]-INT([Calcoli.Q106]))*24-([Calcoli.Q110]-1))*60)-4>=0;INT((([Calcoli.Q106]-INT([Calcoli.Q106]))*24-([Calcoli.Q110]-1))*60)-4;INT((([Calcoli.Q106]-INT([Calcoli.Q106]))*24-([Calcoli.Q110]-1))*60))","v":36},null,"Minuti_GD UQ",{"$f":"of:=IF(INT((([Calcoli.T106]-INT([Calcoli.T106]))*24-([Calcoli.T110]-1))*60)-4>=0;INT((([Calcoli.T106]-INT([Calcoli.T106]))*24-([Calcoli.T110]-1))*60)-4;INT((([Calcoli.T106]-INT([Calcoli.T106]))*24-([Calcoli.T110]-1))*60))","v":35},null,"Minuti_GD UQ",{"$f":"of:=IF(INT((([Calcoli.W106]-INT([Calcoli.W106]))*24-([Calcoli.W110]-1))*60)-4>=0;INT((([Calcoli.W106]-INT([Calcoli.W106]))*24-([Calcoli.W110]-1))*60)-4;INT((([Calcoli.W106]-INT([Calcoli.W106]))*24-([Calcoli.W110]-1))*60))","v":28},null,"Minuti_GD UQ",{"$f":"of:=IF(INT((([Calcoli.Z106]-INT([Calcoli.Z106]))*24-([Calcoli.Z110]-1))*60)-4>=0;INT((([Calcoli.Z106]-INT([Calcoli.Z106]))*24-([Calcoli.Z110]-1))*60)-4;INT((([Calcoli.Z106]-INT([Calcoli.Z106]))*24-([Calcoli.Z110]-1))*60))","v":18},null,"Minuti_GD UQ",{"$f":"of:=IF(INT((([Calcoli.AC106]-INT([Calcoli.AC106]))*24-([Calcoli.AC110]-1))*60)-4>=0;INT((([Calcoli.AC106]-INT([Calcoli.AC106]))*24-([Calcoli.AC110]-1))*60)-4;INT((([Calcoli.AC106]-INT([Calcoli.AC106]))*24-([Calcoli.AC110]-1))*60))","v":27},null,"Minuti_GD UQ",{"$f":"of:=IF(INT((([Calcoli.AF106]-INT([Calcoli.AF106]))*24-([Calcoli.AF110]-1))*60)-4>=0;INT((([Calcoli.AF106]-INT([Calcoli.AF106]))*24-([Calcoli.AF110]-1))*60)-4;INT((([Calcoli.AF106]-INT([Calcoli.AF106]))*24-([Calcoli.AF110]-1))*60))","v":28},null,"Minuti_GD UQ",{"$f":"of:=IF(INT((([Calcoli.AI106]-INT([Calcoli.AI106]))*24-([Calcoli.AI110]-1))*60)-4>=0;INT((([Calcoli.AI106]-INT([Calcoli.AI106]))*24-([Calcoli.AI110]-1))*60)-4;INT((([Calcoli.AI106]-INT([Calcoli.AI106]))*24-([Calcoli.AI110]-1))*60))","v":38},null,"Minuti_GD UQ",{"$f":"of:=IF(INT((([Calcoli.AL106]-INT([Calcoli.AL106]))*24-([Calcoli.AL110]-1))*60)-4>=0;INT((([Calcoli.AL106]-INT([Calcoli.AL106]))*24-([Calcoli.AL110]-1))*60)-4;INT((([Calcoli.AL106]-INT([Calcoli.AL106]))*24-([Calcoli.AL110]-1))*60))","v":53},null,"Minuti_GD UQ",{"$f":"of:=IF(INT((([Calcoli.AO106]-INT([Calcoli.AO106]))*24-([Calcoli.AO110]-1))*60)-4>=0;INT((([Calcoli.AO106]-INT([Calcoli.AO106]))*24-([Calcoli.AO110]-1))*60)-4;INT((([Calcoli.AO106]-INT([Calcoli.AO106]))*24-([Calcoli.AO110]-1))*60))","v":55}]
["Secondi_GD UQ",{"$f":"of:=INT((((([Calcoli.B106]-INT([Calcoli.B106]))*24-([Calcoli.B110]-1))*60)-[Calcoli.B111]-3)*60)","v":-175},null,"Secondi_GD UQ",{"$f":"of:=INT((((([Calcoli.E106]-INT([Calcoli.E106]))*24-([Calcoli.E110]-1))*60)-[Calcoli.E111]-3)*60)-180","v":-332},null,"Secondi_GD UQ",{"$f":"of:=INT((((([Calcoli.H106]-INT([Calcoli.H106]))*24-([Calcoli.H110]-1))*60)-[Calcoli.H111]-3)*60)/2","v":164.5},null,"Secondi_GD UQ",{"$f":"of:=INT((((([Calcoli.K106]-INT([Calcoli.K106]))*24-([Calcoli.K110]-1))*60)-[Calcoli.K111]-3)*60)","v":65},null,"Secondi_GD UQ",{"$f":"of:=INT((((([Calcoli.N106]-INT([Calcoli.N106]))*24-([Calcoli.N110]-1))*60)-[Calcoli.N111]-3)*60)","v":73},null,"Secondi_GD UQ",{"$f":"of:=INT((((([Calcoli.Q106]-INT([Calcoli.Q106]))*24-([Calcoli.Q110]-1))*60)-[Calcoli.Q111]-3)*60)","v":70},null,"Secondi_GD UQ",{"$f":"of:=INT((((([Calcoli.T106]-INT([Calcoli.T106]))*24-([Calcoli.T110]-1))*60)-[Calcoli.T111]-3)*60)","v":119},null,"Secondi_GD UQ",{"$f":"of:=INT((((([Calcoli.W106]-INT([Calcoli.W106]))*24-([Calcoli.W110]-1))*60)-[Calcoli.W111]-3)*60)","v":104},null,"Secondi_GD UQ",{"$f":"of:=INT((((([Calcoli.Z106]-INT([Calcoli.Z106]))*24-([Calcoli.Z110]-1))*60)-[Calcoli.Z111]-3)*60)","v":73},null,"Secondi_GD UQ",{"$f":"of:=INT((((([Calcoli.AC106]-INT([Calcoli.AC106]))*24-([Calcoli.AC110]-1))*60)-[Calcoli.AC111]-3)*60)","v":109},null,"Secondi_GD UQ",{"$f":"of:=INT((((([Calcoli.AF106]-INT([Calcoli.AF106]))*24-([Calcoli.AF110]-1))*60)-[Calcoli.AF111]-3)*60)","v":66},null,"Secondi_GD UQ",{"$f":"of:=INT((((([Calcoli.AI106]-INT([Calcoli.AI106]))*24-([Calcoli.AI110]-1))*60)-[Calcoli.AI111]-3)*60)","v":111},null,"Secondi_GD UQ",{"$f":"of:=INT((((([Calcoli.AL106]-INT([Calcoli.AL106]))*24-([Calcoli.AL110]-1))*60)-[Calcoli.AL111]-3)*60)","v":72},null,"Secondi_GD UQ",{"$f":"of:=INT((((([Calcoli.AO106]-INT([Calcoli.AO106]))*24-([Calcoli.AO110]-1))*60)-[Calcoli.AO111]-3)*60)","v":105}]
[]
["_DATA",{"$f":"of:=YEAR([Calcoli.$A$4])+ROUND(DAYS([Calcoli.$A$4]+15;DATE(YEAR([Calcoli.$A$4]);1;1)-1)/365;4)","v":2016.9616},null,"_DATA",{"$f":"of:=YEAR([Calcoli.$D$4])+ROUND(DAYS([Calcoli.$D$4]+15;DATE(YEAR([Calcoli.$D$4]);1;1)-1)/365;4)","v":2017.0438},null,"_DATA",{"$f":"of:=YEAR([Calcoli.$G$4])+ROUND(DAYS([Calcoli.$G$4]+15;DATE(YEAR([Calcoli.$G$4]);1;1)-1)/365;4)","v":2017.1288},null,"_DATA",{"$f":"of:=YEAR([Calcoli.$J$4])+ROUND(DAYS([Calcoli.$J$4]+15;DATE(YEAR([Calcoli.$J$4]);1;1)-1)/365;4)","v":2017.2055},null,"_DATA",{"$f":"of:=YEAR([Calcoli.$M$4])+ROUND(DAYS([Calcoli.$M$4]+15;DATE(YEAR([Calcoli.$M$4]);1;1)-1)/365;4)","v":2017.2904},null,"_DATA",{"$f":"of:=YEAR([Calcoli.$P$4])+ROUND(DAYS([Calcoli.$P$4]+15;DATE(YEAR([Calcoli.$P$4]);1;1)-1)/365;4)","v":2017.3726},null,"_DATA",{"$f":"of:=YEAR([Calcoli.$S$4])+ROUND(DAYS([Calcoli.$S$4]+15;DATE(YEAR([Calcoli.$S$4]);1;1)-1)/365;4)","v":2017.4575},null,"_DATA",{"$f":"of:=YEAR([Calcoli.$V$4])+ROUND(DAYS([Calcoli.$V$4]+15;DATE(YEAR([Calcoli.$V$4]);1;1)-1)/365;4)","v":2017.5397},null,"_DATA",{"$f":"of:=YEAR([Calcoli.$Y$4])+ROUND(DAYS([Calcoli.$Y$4]+15;DATE(YEAR([Calcoli.$Y$4]);1;1)-1)/365;4)","v":2017.6247},null,"_DATA",{"$f":"of:=YEAR([Calcoli.$AB$4])+ROUND(DAYS([Calcoli.$AB$4]+15;DATE(YEAR([Calcoli.$AB$4]);1;1)-1)/365;4)","v":2017.7096},null,"_DATA",{"$f":"of:=YEAR([Calcoli.$AE$4])+ROUND(DAYS([Calcoli.$AE$4]+15;DATE(YEAR([Calcoli.$AE$4]);1;1)-1)/365;4)","v":2017.7918},null,"_DATA",{"$f":"of:=YEAR([Calcoli.$AH$4])+ROUND(DAYS([Calcoli.$AH$4]+15;DATE(YEAR([Calcoli.$AH$4]);1;1)-1)/365;4)","v":2017.8767},null,"_DATA",{"$f":"of:=YEAR([Calcoli.$AK$4])+ROUND(DAYS([Calcoli.$AK$4]+15;DATE(YEAR([Calcoli.$AK$4]);1;1)-1)/365;4)","v":2017.9589},null,"_DATA",{"$f":"of:=YEAR([Calcoli.$AN$4])+ROUND(DAYS([Calcoli.$AN$4]+15;DATE(YEAR([Calcoli.$AN$4]);1;1)-1)/365;4)","v":2018.0438}]
["K_LN",{"$f":"of:=ROUND((N([Calcoli.B114])-1900)*12.3685;0)","v":1447},null,"K_LN",{"$f":"of:=ROUND((N([Calcoli.E114])-1900)*12.3685;0)","v":1448},null,"K_LN",{"$f":"of:=ROUND((N([Calcoli.H114])-1900)*12.3685;0)","v":1449},null,"K_LN",{"$f":"of:=ROUND((N([Calcoli.K114])-1900)*12.3685;0)","v":1450},null,"K_LN",{"$f":"of:=ROUND((N([Calcoli.N114])-1900)*12.3685;0)","v":1451},null,"K_LN",{"$f":"of:=ROUND((N([Calcoli.Q114])-1900)*12.3685;0)","v":1452},null,"K_LN",{"$f":"of:=ROUND((N([Calcoli.T114])-1900)*12.3685;0)","v":1453},null,"K_LN",{"$f":"of:=ROUND((N([Calcoli.W114])-1900)*12.3685;0)","v":1454},null,"K_LN",{"$f":"of:=ROUND((N([Calcoli.Z114])-1900)*12.3685;0)","v":1455},null,"K_LN",{"$f":"of:=ROUND((N([Calcoli.AC114])-1900)*12.3685;0)","v":1456},null,"K_LN",{"$f":"of:=ROUND((N([Calcoli.AF114])-1900)*12.3685;0)","v":1457},null,"K_LN",{"$f":"of:=ROUND((N([Calcoli.AI114])-1900)*12.3685;0)","v":1458},null,"K_LN",{"$f":"of:=ROUND((N([Calcoli.AL114])-1900)*12.3685;0)","v":1459},null,"K_LN",{"$f":"of:=ROUND((N([Calcoli.AO114])-1900)*12.3685;0)","v":1460}]
["K_PQ",{"$f":"of:=[Calcoli.B115]+0.25","v":1447.25},null,"K_PQ",{"$f":"of:=[Calcoli.E115]+0.25","v":1448.25},null,"K_PQ",{"$f":"of:=[Calcoli.H115]+0.25","v":1449.25},null,"K_PQ",{"$f":"of:=[Calcoli.K115]+0.25","v":1450.25},null,"K_PQ",{"$f":"of:=[Calcoli.N115]+0.25","v":1451.25},null,"K_PQ",{"$f":"of:=[Calcoli.Q115]+0.25","v":1452.25},null,"K_PQ",{"$f":"of:=[Calcoli.T115]+0.25","v":1453.25},null,"K_PQ",{"$f":"of:=[Calcoli.W115]+0.25","v":1454.25},null,"K_PQ",{"$f":"of:=[Calcoli.Z115]+0.25","v":1455.25},null,"K_PQ",{"$f":"of:=[Calcoli.AC115]+0.25","v":1456.25},null,"K_PQ",{"$f":"of:=[Calcoli.AF115]+0.25","v":1457.25},null,"K_PQ",{"$f":"of:=[Calcoli.AI115]+0.25","v":1458.25},null,"K_PQ",{"$f":"of:=[Calcoli.AL115]+0.25","v":1459.25},null,"K_PQ",{"$f":"of:=[Calcoli.AO115]+0.25","v":1460.25}]
["K_LP",{"$f":"of:=[Calcoli.B115]+0.5","v":1447.5},null,"K_LP",{"$f":"of:=[Calcoli.E115]+0.5","v":1448.5},null,"K_LP",{"$f":"of:=[Calcoli.H115]+0.5","v":1449.5},null,"K_LP",{"$f":"of:=[Calcoli.K115]+0.5","v":1450.5},null,"K_LP",{"$f":"of:=[Calcoli.N115]+0.5","v":1451.5},null,"K_LP",{"$f":"of:=[Calcoli.Q115]+0.5","v":1452.5},null,"K_LP",{"$f":"of:=[Calcoli.T115]+0.5","v":1453.5},null,"K_LP",{"$f":"of:=[Calcoli.W115]+0.5","v":1454.5},null,"K_LP",{"$f":"of:=[Calcoli.Z115]+0.5","v":1455.5},null,"K_LP",{"$f":"of:=[Calcoli.AC115]+0.5","v":1456.5},null,"K_LP",{"$f":"of:=[Calcoli.AF115]+0.5","v":1457.5},null,"K_LP",{"$f":"of:=[Calcoli.AI115]+0.5","v":1458.5},null,"K_LP",{"$f":"of:=[Calcoli.AL115]+0.5","v":1459.5},null,"K_LP",{"$f":"of:=[Calcoli.AO115]+0.5","v":1460.5}]
["K_UQ",{"$f":"of:=[Calcoli.B115]+0.75","v":1447.75},null,"K_UQ",{"$f":"of:=[Calcoli.E115]+0.75","v":1448.75},null,"K_UQ",{"$f":"of:=[Calcoli.H115]+0.75","v":1449.75},null,"K_UQ",{"$f":"of:=[Calcoli.K115]+0.75","v":1450.75},null,"K_UQ",{"$f":"of:=[Calcoli.N115]+0.75","v":1451.75},null,"K_UQ",{"$f":"of:=[Calcoli.Q115]+0.75","v":1452.75},null,"K_UQ",{"$f":"of:=[Calcoli.T115]+0.75","v":1453.75},null,"K_UQ",{"$f":"of:=[Calcoli.W115]+0.75","v":1454.75},null,"K_UQ",{"$f":"of:=[Calcoli.Z115]+0.75","v":1455.75},null,"K_UQ",{"$f":"of:=[Calcoli.AC115]+0.75","v":1456.75},null,"K_UQ",{"$f":"of:=[Calcoli.AF115]+0.75","v":1457.75},null,"K_UQ",{"$f":"of:=[Calcoli.AI115]+0.75","v":1458.75},null,"K_UQ",{"$f":"of:=[Calcoli.AL115]+0.75","v":1459.75},null,"K_UQ",{"$f":"of:=[Calcoli.AO115]+0.75","v":1460.75}]
["T_LN",{"$f":"of:=ROUND([Calcoli.B115]/1236.85;5)","v":1.16991},null,"T_LN",{"$f":"of:=ROUND([Calcoli.E115]/1236.85;5)","v":1.17072},null,"T_LN",{"$f":"of:=ROUND([Calcoli.H115]/1236.85;5)","v":1.17152},null,"T_LN",{"$f":"of:=ROUND([Calcoli.K115]/1236.85;5)","v":1.17233},null,"T_LN",{"$f":"of:=ROUND([Calcoli.N115]/1236.85;5)","v":1.17314},null,"T_LN",{"$f":"of:=ROUND([Calcoli.Q115]/1236.85;5)","v":1.17395},null,"T_LN",{"$f":"of:=ROUND([Calcoli.T115]/1236.85;5)","v":1.17476},null,"T_LN",{"$f":"of:=ROUND([Calcoli.W115]/1236.85;5)","v":1.17557},null,"T_LN",{"$f":"of:=ROUND([Calcoli.Z115]/1236.85;5)","v":1.17638},null,"T_LN",{"$f":"of:=ROUND([Calcoli.AC115]/1236.85;5)","v":1.17718},null,"T_LN",{"$f":"of:=ROUND([Calcoli.AF115]/1236.85;5)","v":1.17799},null,"T_LN",{"$f":"of:=ROUND([Calcoli.AI115]/1236.85;5)","v":1.1788},null,"T_LN",{"$f":"of:=ROUND([Calcoli.AL115]/1236.85;5)","v":1.17961},null,"T_LN",{"$f":"of:=ROUND([Calcoli.AO115]/1236.85;5)","v":1.18042}]
["T_PQ",{"$f":"of:=ROUND([Calcoli.B116]/1236.85;5)","v":1.17011},null,"T_PQ",{"$f":"of:=ROUND([Calcoli.E116]/1236.85;5)","v":1.17092},null,"T_PQ",{"$f":"of:=ROUND([Calcoli.H116]/1236.85;5)","v":1.17173},null,"T_PQ",{"$f":"of:=ROUND([Calcoli.K116]/1236.85;5)","v":1.17254},null,"T_PQ",{"$f":"of:=ROUND([Calcoli.N116]/1236.85;5)","v":1.17334},null,"T_PQ",{"$f":"of:=ROUND([Calcoli.Q116]/1236.85;5)","v":1.17415},null,"T_PQ",{"$f":"of:=ROUND([Calcoli.T116]/1236.85;5)","v":1.17496},null,"T_PQ",{"$f":"of:=ROUND([Calcoli.W116]/1236.85;5)","v":1.17577},null,"T_PQ",{"$f":"of:=ROUND([Calcoli.Z116]/1236.85;5)","v":1.17658},null,"T_PQ",{"$f":"of:=ROUND([Calcoli.AC116]/1236.85;5)","v":1.17739},null,"T_PQ",{"$f":"of:=ROUND([Calcoli.AF116]/1236.85;5)","v":1.17819},null,"T_PQ",{"$f":"of:=ROUND([Calcoli.AI116]/1236.85;5)","v":1.179},null,"T_PQ",{"$f":"of:=ROUND([Calcoli.AL116]/1236.85;5)","v":1.17981},null,"T_PQ",{"$f":"of:=ROUND([Calcoli.AO116]/1236.85;5)","v":1.18062}]
["T_LP",{"$f":"of:=ROUND([Calcoli.B117]/1236.85;5)","v":1.17031},null,"T_LP",{"$f":"of:=ROUND([Calcoli.E117]/1236.85;5)","v":1.17112},null,"T_LP",{"$f":"of:=ROUND([Calcoli.H117]/1236.85;5)","v":1.17193},null,"T_LP",{"$f":"of:=ROUND([Calcoli.K117]/1236.85;5)","v":1.17274},null,"T_LP",{"$f":"of:=ROUND([Calcoli.N117]/1236.85;5)","v":1.17355},null,"T_LP",{"$f":"of:=ROUND([Calcoli.Q117]/1236.85;5)","v":1.17435},null,"T_LP",{"$f":"of:=ROUND([Calcoli.T117]/1236.85;5)","v":1.17516},null,"T_LP",{"$f":"of:=ROUND([Calcoli.W117]/1236.85;5)","v":1.17597},null,"T_LP",{"$f":"of:=ROUND([Calcoli.Z117]/1236.85;5)","v":1.17678},null,"T_LP",{"$f":"of:=ROUND([Calcoli.AC117]/1236.85;5)","v":1.17759},null,"T_LP",{"$f":"of:=ROUND([Calcoli.AF117]/1236.85;5)","v":1.1784},null,"T_LP",{"$f":"of:=ROUND([Calcoli.AI117]/1236.85;5)","v":1.17921},null,"T_LP",{"$f":"of:=ROUND([Calcoli.AL117]/1236.85;5)","v":1.18001},null,"T_LP",{"$f":"of:=ROUND([Calcoli.AO117]/1236.85;5)","v":1.18082}]
["T_UQ",{"$f":"of:=ROUND([Calcoli.B118]/1236.85;5)","v":1.17051},null,"T_UQ",{"$f":"of:=ROUND([Calcoli.E118]/1236.85;5)","v":1.17132},null,"T_UQ",{"$f":"of:=ROUND([Calcoli.H118]/1236.85;5)","v":1.17213},null,"T_UQ",{"$f":"of:=ROUND([Calcoli.K118]/1236.85;5)","v":1.17294},null,"T_UQ",{"$f":"of:=ROUND([Calcoli.N118]/1236.85;5)","v":1.17375},null,"T_UQ",{"$f":"of:=ROUND([Calcoli.Q118]/1236.85;5)","v":1.17456},null,"T_UQ",{"$f":"of:=ROUND([Calcoli.T118]/1236.85;5)","v":1.17536},null,"T_UQ",{"$f":"of:=ROUND([Calcoli.W118]/1236.85;5)","v":1.17617},null,"T_UQ",{"$f":"of:=ROUND([Calcoli.Z118]/1236.85;5)","v":1.17698},null,"T_UQ",{"$f":"of:=ROUND([Calcoli.AC118]/1236.85;5)","v":1.17779},null,"T_UQ",{"$f":"of:=ROUND([Calcoli.AF118]/1236.85;5)","v":1.1786},null,"T_UQ",{"$f":"of:=ROUND([Calcoli.AI118]/1236.85;5)","v":1.17941},null,"T_UQ",{"$f":"of:=ROUND([Calcoli.AL118]/1236.85;5)","v":1.18022},null,"T_UQ",{"$f":"of:=ROUND([Calcoli.AO118]/1236.85;5)","v":1.18102}]
["JD_LN",{"$f":"of:=ROUND(2415020.75933+29.53058868*[Calcoli.B115]+0.0001178*[Calcoli.B119]^2-0.000000155*[Calcoli.B119]^3+0.00033*SIN(166.56+132.87*[Calcoli.B119]-0.009*173*[Calcoli.B119]^2);4)","v":2457751.5211},null,"JD_LN",{"$f":"of:=ROUND(2415020.75933+29.53058868*[Calcoli.E115]+0.0001178*[Calcoli.E119]^2-0.000000155*[Calcoli.E119]^3+0.00033*SIN(166.56+132.87*[Calcoli.E119]-0.009*173*[Calcoli.E119]^2);4)","v":2457781.0518},null,"JD_LN",{"$f":"of:=ROUND(2415020.75933+29.53058868*[Calcoli.H115]+0.0001178*[Calcoli.H119]^2-0.000000155*[Calcoli.H119]^3+0.00033*SIN(166.56+132.87*[Calcoli.H119]-0.009*173*[Calcoli.H119]^2);4)","v":2457810.5824},null,"JD_LN",{"$f":"of:=ROUND(2415020.75933+29.53058868*[Calcoli.K115]+0.0001178*[Calcoli.K119]^2-0.000000155*[Calcoli.K119]^3+0.00033*SIN(166.56+132.87*[Calcoli.K119]-0.009*173*[Calcoli.K119]^2);4)","v":2457840.113},null,"JD_LN",{"$f":"of:=ROUND(2415020.75933+29.53058868*[Calcoli.N115]+0.0001178*[Calcoli.N119]^2-0.000000155*[Calcoli.N119]^3+0.00033*SIN(166.56+132.87*[Calcoli.N119]-0.009*173*[Calcoli.N119]^2);4)","v":2457869.6436},null,"JD_LN",{"$f":"of:=ROUND(2415020.75933+29.53058868*[Calcoli.Q115]+0.0001178*[Calcoli.Q119]^2-0.000000155*[Calcoli.Q119]^3+0.00033*SIN(166.56+132.87*[Calcoli.Q119]-0.009*173*[Calcoli.Q119]^2);4)","v":2457899.1742},null,"JD_LN",{"$f":"of:=ROUND(2415020.75933+29.53058868*[Calcoli.T115]+0.0001178*[Calcoli.T119]^2-0.000000155*[Calcoli.T119]^3+0.00033*SIN(166.56+132.87*[Calcoli.T119]-0.009*173*[Calcoli.T119]^2);4)","v":2457928.7049},null,"JD_LN",{"$f":"of:=ROUND(2415020.75933+29.53058868*[Calcoli.W115]+0.0001178*[Calcoli.W119]^2-0.000000155*[Calcoli.W119]^3+0.00033*SIN(166.56+132.87*[Calcoli.W119]-0.009*173*[Calcoli.W119]^2);4)","v":2457958.2355},null,"JD_LN",{"$f":"of:=ROUND(2415020.75933+29.53058868*[Calcoli.Z115]+0.0001178*[Calcoli.Z119]^2-0.000000155*[Calcoli.Z119]^3+0.00033*SIN(166.56+132.87*[Calcoli.Z119]-0.009*173*[Calcoli.Z119]^2);4)","v":2457987.7661},null,"JD_LN",{"$f":"of:=ROUND(2415020.75933+29.53058868*[Calcoli.AC115]+0.0001178*[Calcoli.AC119]^2-0.000000155*[Calcoli.AC119]^3+0.00033*SIN(166.56+132.87*[Calcoli.AC119]-0.009*173*[Calcoli.AC119]^2);4)","v":2458017.2967},null,"JD_LN",{"$f":"of:=ROUND(2415020.75933+29.53058868*[Calcoli.AF115]+0.0001178*[Calcoli.AF119]^2-0.000000155*[Calcoli.AF119]^3+0.00033*SIN(166.56+132.87*[Calcoli.AF119]-0.009*173*[Calcoli.AF119]^2);4)","v":2458046.8274},null,"JD_LN",{"$f":"of:=ROUND(2415020.75933+29.53058868*[Calcoli.AI115]+0.0001178*[Calcoli.AI119]^2-0.000000155*[Calcoli.AI119]^3+0.00033*SIN(166.56+132.87*[Calcoli.AI119]-0.009*173*[Calcoli.AI119]^2);4)","v":2458076.358},null,"JD_LN",{"$f":"of:=ROUND(2415020.75933+29.53058868*[Calcoli.AL115]+0.0001178*[Calcoli.AL119]^2-0.000000155*[Calcoli.AL119]^3+0.00033*SIN(166.56+132.87*[Calcoli.AL119]-0.009*173*[Calcoli.AL119]^2);4)","v":2458105.8886},null,"JD_LN",{"$f":"of:=ROUND(2415020.75933+29.53058868*[Calcoli.AO115]+0.0001178*[Calcoli.AO119]^2-0.000000155*[Calcoli.AO119]^3+0.00033*SIN(166.56+132.87*[Calcoli.AO119]-0.009*173*[Calcoli.AO119]^2);4)","v":2458135.4192}]
["JD_PQ",{"$f":"of:=ROUND(2415020.75933+29.53058868*[Calcoli.B116]+0.0001178*[Calcoli.B120]^2-0.000000155*[Calcoli.B120]^3+0.00033*SIN(166.56+132.87*[Calcoli.B120]-0.009*173*[Calcoli.B120]^2);4)","v":2457758.9038},null,"JD_PQ",{"$f":"of:=ROUND(2415020.75933+29.53058868*[Calcoli.E116]+0.0001178*[Calcoli.E120]^2-0.000000155*[Calcoli.E120]^3+0.00033*SIN(166.56+132.87*[Calcoli.E120]-0.009*173*[Calcoli.E120]^2);4)","v":2457788.4344},null,"JD_PQ",{"$f":"of:=ROUND(2415020.75933+29.53058868*[Calcoli.H116]+0.0001178*[Calcoli.H120]^2-0.000000155*[Calcoli.H120]^3+0.00033*SIN(166.56+132.87*[Calcoli.H120]-0.009*173*[Calcoli.H120]^2);4)","v":2457817.965},null,"JD_PQ",{"$f":"of:=ROUND(2415020.75933+29.53058868*[Calcoli.K116]+0.0001178*[Calcoli.K120]^2-0.000000155*[Calcoli.K120]^3+0.00033*SIN(166.56+132.87*[Calcoli.K120]-0.009*173*[Calcoli.K120]^2);4)","v":2457847.4957},null,"JD_PQ",{"$f":"of:=ROUND(2415020.75933+29.53058868*[Calcoli.N116]+0.0001178*[Calcoli.N120]^2-0.000000155*[Calcoli.N120]^3+0.00033*SIN(166.56+132.87*[Calcoli.N120]-0.009*173*[Calcoli.N120]^2);4)","v":2457877.0263},null,"JD_PQ",{"$f":"of:=ROUND(2415020.75933+29.53058868*[Calcoli.Q116]+0.0001178*[Calcoli.Q120]^2-0.000000155*[Calcoli.Q120]^3+0.00033*SIN(166.56+132.87*[Calcoli.Q120]-0.009*173*[Calcoli.Q120]^2);4)","v":2457906.5569},null,"JD_PQ",{"$f":"of:=ROUND(2415020.75933+29.53058868*[Calcoli.T116]+0.0001178*[Calcoli.T120]^2-0.000000155*[Calcoli.T120]^3+0.00033*SIN(166.56+132.87*[Calcoli.T120]-0.009*173*[Calcoli.T120]^2);4)","v":2457936.0875},null,"JD_PQ",{"$f":"of:=ROUND(2415020.75933+29.53058868*[Calcoli.W116]+0.0001178*[Calcoli.W120]^2-0.000000155*[Calcoli.W120]^3+0.00033*SIN(166.56+132.87*[Calcoli.W120]-0.009*173*[Calcoli.W120]^2);4)","v":2457965.6181},null,"JD_PQ",{"$f":"of:=ROUND(2415020.75933+29.53058868*[Calcoli.Z116]+0.0001178*[Calcoli.Z120]^2-0.000000155*[Calcoli.Z120]^3+0.00033*SIN(166.56+132.87*[Calcoli.Z120]-0.009*173*[Calcoli.Z120]^2);4)","v":2457995.1488},null,"JD_PQ",{"$f":"of:=ROUND(2415020.75933+29.53058868*[Calcoli.AC116]+0.0001178*[Calcoli.AC120]^2-0.000000155*[Calcoli.AC120]^3+0.00033*SIN(166.56+132.87*[Calcoli.AC120]-0.009*173*[Calcoli.AC120]^2);4)","v":2458024.6794},null,"JD_PQ",{"$f":"of:=ROUND(2415020.75933+29.53058868*[Calcoli.AF116]+0.0001178*[Calcoli.AF120]^2-0.000000155*[Calcoli.AF120]^3+0.00033*SIN(166.56+132.87*[Calcoli.AF120]-0.009*173*[Calcoli.AF120]^2);4)","v":2458054.21},null,"JD_PQ",{"$f":"of:=ROUND(2415020.75933+29.53058868*[Calcoli.AI116]+0.0001178*[Calcoli.AI120]^2-0.000000155*[Calcoli.AI120]^3+0.00033*SIN(166.56+132.87*[Calcoli.AI120]-0.009*173*[Calcoli.AI120]^2);4)","v":2458083.7406},null,"JD_PQ",{"$f":"of:=ROUND(2415020.75933+29.53058868*[Calcoli.AL116]+0.0001178*[Calcoli.AL120]^2-0.000000155*[Calcoli.AL120]^3+0.00033*SIN(166.56+132.87*[Calcoli.AL120]-0.009*173*[Calcoli.AL120]^2);4)","v":2458113.2712},null,"JD_PQ",{"$f":"of:=ROUND(2415020.75933+29.53058868*[Calcoli.AO116]+0.0001178*[Calcoli.AO120]^2-0.000000155*[Calcoli.AO120]^3+0.00033*SIN(166.56+132.87*[Calcoli.AO120]-0.009*173*[Calcoli.AO120]^2);4)","v":2458142.8019}]
["JD_LP",{"$f":"of:=ROUND(2415020.75933+29.53058868*[Calcoli.B117]+0.0001178*[Calcoli.B121]^2-0.000000155*[Calcoli.B121]^3+0.00033*SIN(166.56+132.87*[Calcoli.B121]-0.009*173*[Calcoli.B121]^2);4)","v":2457766.2864},null,"JD_LP",{"$f":"of:=ROUND(2415020.75933+29.53058868*[Calcoli.E117]+0.0001178*[Calcoli.E121]^2-0.000000155*[Calcoli.E121]^3+0.00033*SIN(166.56+132.87*[Calcoli.E121]-0.009*173*[Calcoli.E121]^2);4)","v":2457795.8171},null,"JD_LP",{"$f":"of:=ROUND(2415020.75933+29.53058868*[Calcoli.H117]+0.0001178*[Calcoli.H121]^2-0.000000155*[Calcoli.H121]^3+0.00033*SIN(166.56+132.87*[Calcoli.H121]-0.009*173*[Calcoli.H121]^2);4)","v":2457825.3477},null,"JD_LP",{"$f":"of:=ROUND(2415020.75933+29.53058868*[Calcoli.K117]+0.0001178*[Calcoli.K121]^2-0.000000155*[Calcoli.K121]^3+0.00033*SIN(166.56+132.87*[Calcoli.K121]-0.009*173*[Calcoli.K121]^2);4)","v":2457854.8783},null,"JD_LP",{"$f":"of:=ROUND(2415020.75933+29.53058868*[Calcoli.N117]+0.0001178*[Calcoli.N121]^2-0.000000155*[Calcoli.N121]^3+0.00033*SIN(166.56+132.87*[Calcoli.N121]-0.009*173*[Calcoli.N121]^2);4)","v":2457884.4089},null,"JD_LP",{"$f":"of:=ROUND(2415020.75933+29.53058868*[Calcoli.Q117]+0.0001178*[Calcoli.Q121]^2-0.000000155*[Calcoli.Q121]^3+0.00033*SIN(166.56+132.87*[Calcoli.Q121]-0.009*173*[Calcoli.Q121]^2);4)","v":2457913.9396},null,"JD_LP",{"$f":"of:=ROUND(2415020.75933+29.53058868*[Calcoli.T117]+0.0001178*[Calcoli.T121]^2-0.000000155*[Calcoli.T121]^3+0.00033*SIN(166.56+132.87*[Calcoli.T121]-0.009*173*[Calcoli.T121]^2);4)","v":2457943.4702},null,"JD_LP",{"$f":"of:=ROUND(2415020.75933+29.53058868*[Calcoli.W117]+0.0001178*[Calcoli.W121]^2-0.000000155*[Calcoli.W121]^3+0.00033*SIN(166.56+132.87*[Calcoli.W121]-0.009*173*[Calcoli.W121]^2);4)","v":2457973.0008},null,"JD_LP",{"$f":"of:=ROUND(2415020.75933+29.53058868*[Calcoli.Z117]+0.0001178*[Calcoli.Z121]^2-0.000000155*[Calcoli.Z121]^3+0.00033*SIN(166.56+132.87*[Calcoli.Z121]-0.009*173*[Calcoli.Z121]^2);4)","v":2458002.5314},null,"JD_LP",{"$f":"of:=ROUND(2415020.75933+29.53058868*[Calcoli.AC117]+0.0001178*[Calcoli.AC121]^2-0.000000155*[Calcoli.AC121]^3+0.00033*SIN(166.56+132.87*[Calcoli.AC121]-0.009*173*[Calcoli.AC121]^2);4)","v":2458032.062},null,"JD_LP",{"$f":"of:=ROUND(2415020.75933+29.53058868*[Calcoli.AF117]+0.0001178*[Calcoli.AF121]^2-0.000000155*[Calcoli.AF121]^3+0.00033*SIN(166.56+132.87*[Calcoli.AF121]-0.009*173*[Calcoli.AF121]^2);4)","v":2458061.5927},null,"JD_LP",{"$f":"of:=ROUND(2415020.75933+29.53058868*[Calcoli.AI117]+0.0001178*[Calcoli.AI121]^2-0.000000155*[Calcoli.AI121]^3+0.00033*SIN(166.56+132.87*[Calcoli.AI121]-0.009*173*[Calcoli.AI121]^2);4)","v":2458091.1233},null,"JD_LP",{"$f":"of:=ROUND(2415020.75933+29.53058868*[Calcoli.AL117]+0.0001178*[Calcoli.AL121]^2-0.000000155*[Calcoli.AL121]^3+0.00033*SIN(166.56+132.87*[Calcoli.AL121]-0.009*173*[Calcoli.AL121]^2);4)","v":2458120.6539},null,"JD_LP",{"$f":"of:=ROUND(2415020.75933+29.53058868*[Calcoli.AO117]+0.0001178*[Calcoli.AO121]^2-0.000000155*[Calcoli.AO121]^3+0.00033*SIN(166.56+132.87*[Calcoli.AO121]-0.009*173*[Calcoli.AO121]^2);4)","v":2458150.1845}]
["JD_UQ",{"$f":"of:=ROUND(2415020.75933+29.53058868*[Calcoli.B118]+0.0001178*[Calcoli.B122]^2-0.000000155*[Calcoli.B122]^3+0.00033*SIN(166.56+132.87*[Calcoli.B122]-0.009*173*[Calcoli.B122]^2);4)","v":2457773.6691},null,"JD_UQ",{"$f":"of:=ROUND(2415020.75933+29.53058868*[Calcoli.E118]+0.0001178*[Calcoli.E122]^2-0.000000155*[Calcoli.E122]^3+0.00033*SIN(166.56+132.87*[Calcoli.E122]-0.009*173*[Calcoli.E122]^2);4)","v":2457803.1997},null,"JD_UQ",{"$f":"of:=ROUND(2415020.75933+29.53058868*[Calcoli.H118]+0.0001178*[Calcoli.H122]^2-0.000000155*[Calcoli.H122]^3+0.00033*SIN(166.56+132.87*[Calcoli.H122]-0.009*173*[Calcoli.H122]^2);4)","v":2457832.7303},null,"JD_UQ",{"$f":"of:=ROUND(2415020.75933+29.53058868*[Calcoli.K118]+0.0001178*[Calcoli.K122]^2-0.000000155*[Calcoli.K122]^3+0.00033*SIN(166.56+132.87*[Calcoli.K122]-0.009*173*[Calcoli.K122]^2);4)","v":2457862.261},null,"JD_UQ",{"$f":"of:=ROUND(2415020.75933+29.53058868*[Calcoli.N118]+0.0001178*[Calcoli.N122]^2-0.000000155*[Calcoli.N122]^3+0.00033*SIN(166.56+132.87*[Calcoli.N122]-0.009*173*[Calcoli.N122]^2);4)","v":2457891.7916},null,"JD_UQ",{"$f":"of:=ROUND(2415020.75933+29.53058868*[Calcoli.Q118]+0.0001178*[Calcoli.Q122]^2-0.000000155*[Calcoli.Q122]^3+0.00033*SIN(166.56+132.87*[Calcoli.Q122]-0.009*173*[Calcoli.Q122]^2);4)","v":2457921.3222},null,"JD_UQ",{"$f":"of:=ROUND(2415020.75933+29.53058868*[Calcoli.T118]+0.0001178*[Calcoli.T122]^2-0.000000155*[Calcoli.T122]^3+0.00033*SIN(166.56+132.87*[Calcoli.T122]-0.009*173*[Calcoli.T122]^2);4)","v":2457950.8528},null,"JD_UQ",{"$f":"of:=ROUND(2415020.75933+29.53058868*[Calcoli.W118]+0.0001178*[Calcoli.W122]^2-0.000000155*[Calcoli.W122]^3+0.00033*SIN(166.56+132.87*[Calcoli.W122]-0.009*173*[Calcoli.W122]^2);4)","v":2457980.3835},null,"JD_UQ",{"$f":"of:=ROUND(2415020.75933+29.53058868*[Calcoli.Z118]+0.0001178*[Calcoli.Z122]^2-0.000000155*[Calcoli.Z122]^3+0.00033*SIN(166.56+132.87*[Calcoli.Z122]-0.009*173*[Calcoli.Z122]^2);4)","v":2458009.9141},null,"JD_UQ",{"$f":"of:=ROUND(2415020.75933+29.53058868*[Calcoli.AC118]+0.0001178*[Calcoli.AC122]^2-0.000000155*[Calcoli.AC122]^3+0.00033*SIN(166.56+132.87*[Calcoli.AC122]-0.009*173*[Calcoli.AC122]^2);4)","v":2458039.4447},null,"JD_UQ",{"$f":"of:=ROUND(2415020.75933+29.53058868*[Calcoli.AF118]+0.0001178*[Calcoli.AF122]^2-0.000000155*[Calcoli.AF122]^3+0.00033*SIN(166.56+132.87*[Calcoli.AF122]-0.009*173*[Calcoli.AF122]^2);4)","v":2458068.9753},null,"JD_UQ",{"$f":"of:=ROUND(2415020.75933+29.53058868*[Calcoli.AI118]+0.0001178*[Calcoli.AI122]^2-0.000000155*[Calcoli.AI122]^3+0.00033*SIN(166.56+132.87*[Calcoli.AI122]-0.009*173*[Calcoli.AI122]^2);4)","v":2458098.5059},null,"JD_UQ",{"$f":"of:=ROUND(2415020.75933+29.53058868*[Calcoli.AL118]+0.0001178*[Calcoli.AL122]^2-0.000000155*[Calcoli.AL122]^3+0.00033*SIN(166.56+132.87*[Calcoli.AL122]-0.009*173*[Calcoli.AL122]^2);4)","v":2458128.0365},null,"JD_UQ",{"$f":"of:=ROUND(2415020.75933+29.53058868*[Calcoli.AO118]+0.0001178*[Calcoli.AO122]^2-0.000000155*[Calcoli.AO122]^3+0.00033*SIN(166.56+132.87*[Calcoli.AO122]-0.009*173*[Calcoli.AO122]^2);4)","v":2458157.5672}]
["M_LN",{"$f":"of:=ROUND(359.2242+29.10535608*[Calcoli.B115]-0.0000333*[Calcoli.B119]^2-0.00000347*[Calcoli.B119]^3;4)","v":42474.6744},null,"M_LN",{"$f":"of:=ROUND(359.2242+29.10535608*[Calcoli.E115]-0.0000333*[Calcoli.E119]^2-0.00000347*[Calcoli.E119]^3;4)","v":42503.7798},null,"M_LN",{"$f":"of:=ROUND(359.2242+29.10535608*[Calcoli.H115]-0.0000333*[Calcoli.H119]^2-0.00000347*[Calcoli.H119]^3;4)","v":42532.8851},null,"M_LN",{"$f":"of:=ROUND(359.2242+29.10535608*[Calcoli.K115]-0.0000333*[Calcoli.K119]^2-0.00000347*[Calcoli.K119]^3;4)","v":42561.9905},null,"M_LN",{"$f":"of:=ROUND(359.2242+29.10535608*[Calcoli.N115]-0.0000333*[Calcoli.N119]^2-0.00000347*[Calcoli.N119]^3;4)","v":42591.0958},null,"M_LN",{"$f":"of:=ROUND(359.2242+29.10535608*[Calcoli.Q115]-0.0000333*[Calcoli.Q119]^2-0.00000347*[Calcoli.Q119]^3;4)","v":42620.2012},null,"M_LN",{"$f":"of:=ROUND(359.2242+29.10535608*[Calcoli.T115]-0.0000333*[Calcoli.T119]^2-0.00000347*[Calcoli.T119]^3;4)","v":42649.3065},null,"M_LN",{"$f":"of:=ROUND(359.2242+29.10535608*[Calcoli.W115]-0.0000333*[Calcoli.W119]^2-0.00000347*[Calcoli.W119]^3;4)","v":42678.4119},null,"M_LN",{"$f":"of:=ROUND(359.2242+29.10535608*[Calcoli.Z115]-0.0000333*[Calcoli.Z119]^2-0.00000347*[Calcoli.Z119]^3;4)","v":42707.5172},null,"M_LN",{"$f":"of:=ROUND(359.2242+29.10535608*[Calcoli.AC115]-0.0000333*[Calcoli.AC119]^2-0.00000347*[Calcoli.AC119]^3;4)","v":42736.6226},null,"M_LN",{"$f":"of:=ROUND(359.2242+29.10535608*[Calcoli.AF115]-0.0000333*[Calcoli.AF119]^2-0.00000347*[Calcoli.AF119]^3;4)","v":42765.728},null,"M_LN",{"$f":"of:=ROUND(359.2242+29.10535608*[Calcoli.AI115]-0.0000333*[Calcoli.AI119]^2-0.00000347*[Calcoli.AI119]^3;4)","v":42794.8333},null,"M_LN",{"$f":"of:=ROUND(359.2242+29.10535608*[Calcoli.AL115]-0.0000333*[Calcoli.AL119]^2-0.00000347*[Calcoli.AL119]^3;4)","v":42823.9387},null,"M_LN",{"$f":"of:=ROUND(359.2242+29.10535608*[Calcoli.AO115]-0.0000333*[Calcoli.AO119]^2-0.00000347*[Calcoli.AO119]^3;4)","v":42853.044}]
["M_a",{"$f":"of:=ROUND(INT([Calcoli.B127])-(INT(INT([Calcoli.B127])/360))*360+[Calcoli.B127]-INT([Calcoli.B127]);4)","v":354.6744},null,"M_a",{"$f":"of:=ROUND(INT([Calcoli.E127])-(INT(INT([Calcoli.E127])/360))*360+[Calcoli.E127]-INT([Calcoli.E127]);4)","v":23.7798},null,"M_a",{"$f":"of:=ROUND(INT([Calcoli.H127])-(INT(INT([Calcoli.H127])/360))*360+[Calcoli.H127]-INT([Calcoli.H127]);4)","v":52.8851},null,"M_a",{"$f":"of:=ROUND(INT([Calcoli.K127])-(INT(INT([Calcoli.K127])/360))*360+[Calcoli.K127]-INT([Calcoli.K127]);4)","v":81.9905},null,"M_a",{"$f":"of:=ROUND(INT([Calcoli.N127])-(INT(INT([Calcoli.N127])/360))*360+[Calcoli.N127]-INT([Calcoli.N127]);4)","v":111.0958},null,"M_a",{"$f":"of:=ROUND(INT([Calcoli.Q127])-(INT(INT([Calcoli.Q127])/360))*360+[Calcoli.Q127]-INT([Calcoli.Q127]);4)","v":140.2012},null,"M_a",{"$f":"of:=ROUND(INT([Calcoli.T127])-(INT(INT([Calcoli.T127])/360))*360+[Calcoli.T127]-INT([Calcoli.T127]);4)","v":169.3065},null,"M_a",{"$f":"of:=ROUND(INT([Calcoli.W127])-(INT(INT([Calcoli.W127])/360))*360+[Calcoli.W127]-INT([Calcoli.W127]);4)","v":198.4119},null,"M_a",{"$f":"of:=ROUND(INT([Calcoli.Z127])-(INT(INT([Calcoli.Z127])/360))*360+[Calcoli.Z127]-INT([Calcoli.Z127]);4)","v":227.5172},null,"M_a",{"$f":"of:=ROUND(INT([Calcoli.AC127])-(INT(INT([Calcoli.AC127])/360))*360+[Calcoli.AC127]-INT([Calcoli.AC127]);4)","v":256.6226},null,"M_a",{"$f":"of:=ROUND(INT([Calcoli.AF127])-(INT(INT([Calcoli.AF127])/360))*360+[Calcoli.AF127]-INT([Calcoli.AF127]);4)","v":285.728},null,"M_a",{"$f":"of:=ROUND(INT([Calcoli.AI127])-(INT(INT([Calcoli.AI127])/360))*360+[Calcoli.AI127]-INT([Calcoli.AI127]);4)","v":314.8333},null,"M_a",{"$f":"of:=ROUND(INT([Calcoli.AL127])-(INT(INT([Calcoli.AL127])/360))*360+[Calcoli.AL127]-INT([Calcoli.AL127]);4)","v":343.9387},null,"M_a",{"$f":"of:=ROUND(INT([Calcoli.AO127])-(INT(INT([Calcoli.AO127])/360))*360+[Calcoli.AO127]-INT([Calcoli.AO127]);4)","v":13.044}]
["M_PQ",{"$f":"of:=ROUND(359.2242+29.10535608*[Calcoli.B116]-0.0000333*[Calcoli.B120]^2-0.00000347*[Calcoli.B120]^3;4)","v":42481.9507},null,"M_PQ",{"$f":"of:=ROUND(359.2242+29.10535608*[Calcoli.E116]-0.0000333*[Calcoli.E120]^2-0.00000347*[Calcoli.E120]^3;4)","v":42511.0561},null,"M_PQ",{"$f":"of:=ROUND(359.2242+29.10535608*[Calcoli.H116]-0.0000333*[Calcoli.H120]^2-0.00000347*[Calcoli.H120]^3;4)","v":42540.1614},null,"M_PQ",{"$f":"of:=ROUND(359.2242+29.10535608*[Calcoli.K116]-0.0000333*[Calcoli.K120]^2-0.00000347*[Calcoli.K120]^3;4)","v":42569.2668},null,"M_PQ",{"$f":"of:=ROUND(359.2242+29.10535608*[Calcoli.N116]-0.0000333*[Calcoli.N120]^2-0.00000347*[Calcoli.N120]^3;4)","v":42598.3722},null,"M_PQ",{"$f":"of:=ROUND(359.2242+29.10535608*[Calcoli.Q116]-0.0000333*[Calcoli.Q120]^2-0.00000347*[Calcoli.Q120]^3;4)","v":42627.4775},null,"M_PQ",{"$f":"of:=ROUND(359.2242+29.10535608*[Calcoli.T116]-0.0000333*[Calcoli.T120]^2-0.00000347*[Calcoli.T120]^3;4)","v":42656.5829},null,"M_PQ",{"$f":"of:=ROUND(359.2242+29.10535608*[Calcoli.W116]-0.0000333*[Calcoli.W120]^2-0.00000347*[Calcoli.W120]^3;4)","v":42685.6882},null,"M_PQ",{"$f":"of:=ROUND(359.2242+29.10535608*[Calcoli.Z116]-0.0000333*[Calcoli.Z120]^2-0.00000347*[Calcoli.Z120]^3;4)","v":42714.7936},null,"M_PQ",{"$f":"of:=ROUND(359.2242+29.10535608*[Calcoli.AC116]-0.0000333*[Calcoli.AC120]^2-0.00000347*[Calcoli.AC120]^3;4)","v":42743.8989},null,"M_PQ",{"$f":"of:=ROUND(359.2242+29.10535608*[Calcoli.AF116]-0.0000333*[Calcoli.AF120]^2-0.00000347*[Calcoli.AF120]^3;4)","v":42773.0043},null,"M_PQ",{"$f":"of:=ROUND(359.2242+29.10535608*[Calcoli.AI116]-0.0000333*[Calcoli.AI120]^2-0.00000347*[Calcoli.AI120]^3;4)","v":42802.1097},null,"M_PQ",{"$f":"of:=ROUND(359.2242+29.10535608*[Calcoli.AL116]-0.0000333*[Calcoli.AL120]^2-0.00000347*[Calcoli.AL120]^3;4)","v":42831.215},null,"M_PQ",{"$f":"of:=ROUND(359.2242+29.10535608*[Calcoli.AO116]-0.0000333*[Calcoli.AO120]^2-0.00000347*[Calcoli.AO120]^3;4)","v":42860.3204}]
["M_LP",{"$f":"of:=ROUND(359.2242+29.10535608*[Calcoli.B117]-0.0000333*[Calcoli.B121]^2-0.00000347*[Calcoli.B121]^3;4)","v":42489.2271},null,"M_LP",{"$f":"of:=ROUND(359.2242+29.10535608*[Calcoli.E117]-0.0000333*[Calcoli.E121]^2-0.00000347*[Calcoli.E121]^3;4)","v":42518.3324},null,"M_LP",{"$f":"of:=ROUND(359.2242+29.10535608*[Calcoli.H117]-0.0000333*[Calcoli.H121]^2-0.00000347*[Calcoli.H121]^3;4)","v":42547.4378},null,"M_LP",{"$f":"of:=ROUND(359.2242+29.10535608*[Calcoli.K117]-0.0000333*[Calcoli.K121]^2-0.00000347*[Calcoli.K121]^3;4)","v":42576.5431},null,"M_LP",{"$f":"of:=ROUND(359.2242+29.10535608*[Calcoli.N117]-0.0000333*[Calcoli.N121]^2-0.00000347*[Calcoli.N121]^3;4)","v":42605.6485},null,"M_LP",{"$f":"of:=ROUND(359.2242+29.10535608*[Calcoli.Q117]-0.0000333*[Calcoli.Q121]^2-0.00000347*[Calcoli.Q121]^3;4)","v":42634.7539},null,"M_LP",{"$f":"of:=ROUND(359.2242+29.10535608*[Calcoli.T117]-0.0000333*[Calcoli.T121]^2-0.00000347*[Calcoli.T121]^3;4)","v":42663.8592},null,"M_LP",{"$f":"of:=ROUND(359.2242+29.10535608*[Calcoli.W117]-0.0000333*[Calcoli.W121]^2-0.00000347*[Calcoli.W121]^3;4)","v":42692.9646},null,"M_LP",{"$f":"of:=ROUND(359.2242+29.10535608*[Calcoli.Z117]-0.0000333*[Calcoli.Z121]^2-0.00000347*[Calcoli.Z121]^3;4)","v":42722.0699},null,"M_LP",{"$f":"of:=ROUND(359.2242+29.10535608*[Calcoli.AC117]-0.0000333*[Calcoli.AC121]^2-0.00000347*[Calcoli.AC121]^3;4)","v":42751.1753},null,"M_LP",{"$f":"of:=ROUND(359.2242+29.10535608*[Calcoli.AF117]-0.0000333*[Calcoli.AF121]^2-0.00000347*[Calcoli.AF121]^3;4)","v":42780.2806},null,"M_LP",{"$f":"of:=ROUND(359.2242+29.10535608*[Calcoli.AI117]-0.0000333*[Calcoli.AI121]^2-0.00000347*[Calcoli.AI121]^3;4)","v":42809.386},null,"M_LP",{"$f":"of:=ROUND(359.2242+29.10535608*[Calcoli.AL117]-0.0000333*[Calcoli.AL121]^2-0.00000347*[Calcoli.AL121]^3;4)","v":42838.4913},null,"M_LP",{"$f":"of:=ROUND(359.2242+29.10535608*[Calcoli.AO117]-0.0000333*[Calcoli.AO121]^2-0.00000347*[Calcoli.AO121]^3;4)","v":42867.5967}]
["M_UQ",{"$f":"of:=ROUND(359.2242+29.10535608*[Calcoli.B118]-0.0000333*[Calcoli.B122]^2-0.00000347*[Calcoli.B122]^3;4)","v":42496.5034},null,"M_UQ",{"$f":"of:=ROUND(359.2242+29.10535608*[Calcoli.E118]-0.0000333*[Calcoli.E122]^2-0.00000347*[Calcoli.E122]^3;4)","v":42525.6088},null,"M_UQ",{"$f":"of:=ROUND(359.2242+29.10535608*[Calcoli.H118]-0.0000333*[Calcoli.H122]^2-0.00000347*[Calcoli.H122]^3;4)","v":42554.7141},null,"M_UQ",{"$f":"of:=ROUND(359.2242+29.10535608*[Calcoli.K118]-0.0000333*[Calcoli.K122]^2-0.00000347*[Calcoli.K122]^3;4)","v":42583.8195},null,"M_UQ",{"$f":"of:=ROUND(359.2242+29.10535608*[Calcoli.N118]-0.0000333*[Calcoli.N122]^2-0.00000347*[Calcoli.N122]^3;4)","v":42612.9248},null,"M_UQ",{"$f":"of:=ROUND(359.2242+29.10535608*[Calcoli.Q118]-0.0000333*[Calcoli.Q122]^2-0.00000347*[Calcoli.Q122]^3;4)","v":42642.0302},null,"M_UQ",{"$f":"of:=ROUND(359.2242+29.10535608*[Calcoli.T118]-0.0000333*[Calcoli.T122]^2-0.00000347*[Calcoli.T122]^3;4)","v":42671.1355},null,"M_UQ",{"$f":"of:=ROUND(359.2242+29.10535608*[Calcoli.W118]-0.0000333*[Calcoli.W122]^2-0.00000347*[Calcoli.W122]^3;4)","v":42700.2409},null,"M_UQ",{"$f":"of:=ROUND(359.2242+29.10535608*[Calcoli.Z118]-0.0000333*[Calcoli.Z122]^2-0.00000347*[Calcoli.Z122]^3;4)","v":42729.3463},null,"M_UQ",{"$f":"of:=ROUND(359.2242+29.10535608*[Calcoli.AC118]-0.0000333*[Calcoli.AC122]^2-0.00000347*[Calcoli.AC122]^3;4)","v":42758.4516},null,"M_UQ",{"$f":"of:=ROUND(359.2242+29.10535608*[Calcoli.AF118]-0.0000333*[Calcoli.AF122]^2-0.00000347*[Calcoli.AF122]^3;4)","v":42787.557},null,"M_UQ",{"$f":"of:=ROUND(359.2242+29.10535608*[Calcoli.AI118]-0.0000333*[Calcoli.AI122]^2-0.00000347*[Calcoli.AI122]^3;4)","v":42816.6623},null,"M_UQ",{"$f":"of:=ROUND(359.2242+29.10535608*[Calcoli.AL118]-0.0000333*[Calcoli.AL122]^2-0.00000347*[Calcoli.AL122]^3;4)","v":42845.7677},null,"M_UQ",{"$f":"of:=ROUND(359.2242+29.10535608*[Calcoli.AO118]-0.0000333*[Calcoli.AO122]^2-0.00000347*[Calcoli.AO122]^3;4)","v":42874.873}]
["M1_LN",{"$f":"of:=ROUND(306.0253+385.81691806*[Calcoli.B115]+0.0107306*[Calcoli.B119]^2+0.00001236*[Calcoli.B119]^3;4)","v":558583.1204},null,"M1_LN",{"$f":"of:=ROUND(306.0253+385.81691806*[Calcoli.E115]+0.0107306*[Calcoli.E119]^2+0.00001236*[Calcoli.E119]^3;4)","v":558968.9374},null,"M1_LN",{"$f":"of:=ROUND(306.0253+385.81691806*[Calcoli.H115]+0.0107306*[Calcoli.H119]^2+0.00001236*[Calcoli.H119]^3;4)","v":559354.7543},null,"M1_LN",{"$f":"of:=ROUND(306.0253+385.81691806*[Calcoli.K115]+0.0107306*[Calcoli.K119]^2+0.00001236*[Calcoli.K119]^3;4)","v":559740.5713},null,"M1_LN",{"$f":"of:=ROUND(306.0253+385.81691806*[Calcoli.N115]+0.0107306*[Calcoli.N119]^2+0.00001236*[Calcoli.N119]^3;4)","v":560126.3882},null,"M1_LN",{"$f":"of:=ROUND(306.0253+385.81691806*[Calcoli.Q115]+0.0107306*[Calcoli.Q119]^2+0.00001236*[Calcoli.Q119]^3;4)","v":560512.2051},null,"M1_LN",{"$f":"of:=ROUND(306.0253+385.81691806*[Calcoli.T115]+0.0107306*[Calcoli.T119]^2+0.00001236*[Calcoli.T119]^3;4)","v":560898.0221},null,"M1_LN",{"$f":"of:=ROUND(306.0253+385.81691806*[Calcoli.W115]+0.0107306*[Calcoli.W119]^2+0.00001236*[Calcoli.W119]^3;4)","v":561283.839},null,"M1_LN",{"$f":"of:=ROUND(306.0253+385.81691806*[Calcoli.Z115]+0.0107306*[Calcoli.Z119]^2+0.00001236*[Calcoli.Z119]^3;4)","v":561669.6559},null,"M1_LN",{"$f":"of:=ROUND(306.0253+385.81691806*[Calcoli.AC115]+0.0107306*[Calcoli.AC119]^2+0.00001236*[Calcoli.AC119]^3;4)","v":562055.4729},null,"M1_LN",{"$f":"of:=ROUND(306.0253+385.81691806*[Calcoli.AF115]+0.0107306*[Calcoli.AF119]^2+0.00001236*[Calcoli.AF119]^3;4)","v":562441.2898},null,"M1_LN",{"$f":"of:=ROUND(306.0253+385.81691806*[Calcoli.AI115]+0.0107306*[Calcoli.AI119]^2+0.00001236*[Calcoli.AI119]^3;4)","v":562827.1068},null,"M1_LN",{"$f":"of:=ROUND(306.0253+385.81691806*[Calcoli.AL115]+0.0107306*[Calcoli.AL119]^2+0.00001236*[Calcoli.AL119]^3;4)","v":563212.9237},null,"M1_LN",{"$f":"of:=ROUND(306.0253+385.81691806*[Calcoli.AO115]+0.0107306*[Calcoli.AO119]^2+0.00001236*[Calcoli.AO119]^3;4)","v":563598.7406}]
["M1_a",{"$f":"of:=ROUND(INT([Calcoli.B132])-INT((INT([Calcoli.B132])/360))*360+[Calcoli.B132]-INT([Calcoli.B132]);4)","v":223.1204},null,"M1_a",{"$f":"of:=ROUND(INT([Calcoli.E132])-INT((INT([Calcoli.E132])/360))*360+[Calcoli.E132]-INT([Calcoli.E132]);4)","v":248.9374},null,"M1_a",{"$f":"of:=ROUND(INT([Calcoli.H132])-INT((INT([Calcoli.H132])/360))*360+[Calcoli.H132]-INT([Calcoli.H132]);4)","v":274.7543},null,"M1_a",{"$f":"of:=ROUND(INT([Calcoli.K132])-INT((INT([Calcoli.K132])/360))*360+[Calcoli.K132]-INT([Calcoli.K132]);4)","v":300.5713},null,"M1_a",{"$f":"of:=ROUND(INT([Calcoli.N132])-INT((INT([Calcoli.N132])/360))*360+[Calcoli.N132]-INT([Calcoli.N132]);4)","v":326.3882},null,"M1_a",{"$f":"of:=ROUND(INT([Calcoli.Q132])-INT((INT([Calcoli.Q132])/360))*360+[Calcoli.Q132]-INT([Calcoli.Q132]);4)","v":352.2051},null,"M1_a",{"$f":"of:=ROUND(INT([Calcoli.T132])-INT((INT([Calcoli.T132])/360))*360+[Calcoli.T132]-INT([Calcoli.T132]);4)","v":18.0221},null,"M1_a",{"$f":"of:=ROUND(INT([Calcoli.W132])-INT((INT([Calcoli.W132])/360))*360+[Calcoli.W132]-INT([Calcoli.W132]);4)","v":43.839},null,"M1_a",{"$f":"of:=ROUND(INT([Calcoli.Z132])-INT((INT([Calcoli.Z132])/360))*360+[Calcoli.Z132]-INT([Calcoli.Z132]);4)","v":69.6559},null,"M1_a",{"$f":"of:=ROUND(INT([Calcoli.AC132])-INT((INT([Calcoli.AC132])/360))*360+[Calcoli.AC132]-INT([Calcoli.AC132]);4)","v":95.4729},null,"M1_a",{"$f":"of:=ROUND(INT([Calcoli.AF132])-INT((INT([Calcoli.AF132])/360))*360+[Calcoli.AF132]-INT([Calcoli.AF132]);4)","v":121.2898},null,"M1_a",{"$f":"of:=ROUND(INT([Calcoli.AI132])-INT((INT([Calcoli.AI132])/360))*360+[Calcoli.AI132]-INT([Calcoli.AI132]);4)","v":147.1068},null,"M1_a",{"$f":"of:=ROUND(INT([Calcoli.AL132])-INT((INT([Calcoli.AL132])/360))*360+[Calcoli.AL132]-INT([Calcoli.AL132]);4)","v":172.9237},null,"M1_a",{"$f":"of:=ROUND(INT([Calcoli.AO132])-INT((INT([Calcoli.AO132])/360))*360+[Calcoli.AO132]-INT([Calcoli.AO132]);4)","v":198.7406}]
["M1_PQ",{"$f":"of:=ROUND(306.0253+385.81691806*[Calcoli.B116]+0.0107306*[Calcoli.B120]^2+0.00001236*[Calcoli.B120]^3;4)","v":558679.5747},null,"M1_PQ",{"$f":"of:=ROUND(306.0253+385.81691806*[Calcoli.E116]+0.0107306*[Calcoli.E120]^2+0.00001236*[Calcoli.E120]^3;4)","v":559065.3916},null,"M1_PQ",{"$f":"of:=ROUND(306.0253+385.81691806*[Calcoli.H116]+0.0107306*[Calcoli.H120]^2+0.00001236*[Calcoli.H120]^3;4)","v":559451.2086},null,"M1_PQ",{"$f":"of:=ROUND(306.0253+385.81691806*[Calcoli.K116]+0.0107306*[Calcoli.K120]^2+0.00001236*[Calcoli.K120]^3;4)","v":559837.0255},null,"M1_PQ",{"$f":"of:=ROUND(306.0253+385.81691806*[Calcoli.N116]+0.0107306*[Calcoli.N120]^2+0.00001236*[Calcoli.N120]^3;4)","v":560222.8424},null,"M1_PQ",{"$f":"of:=ROUND(306.0253+385.81691806*[Calcoli.Q116]+0.0107306*[Calcoli.Q120]^2+0.00001236*[Calcoli.Q120]^3;4)","v":560608.6594},null,"M1_PQ",{"$f":"of:=ROUND(306.0253+385.81691806*[Calcoli.T116]+0.0107306*[Calcoli.T120]^2+0.00001236*[Calcoli.T120]^3;4)","v":560994.4763},null,"M1_PQ",{"$f":"of:=ROUND(306.0253+385.81691806*[Calcoli.W116]+0.0107306*[Calcoli.W120]^2+0.00001236*[Calcoli.W120]^3;4)","v":561380.2932},null,"M1_PQ",{"$f":"of:=ROUND(306.0253+385.81691806*[Calcoli.Z116]+0.0107306*[Calcoli.Z120]^2+0.00001236*[Calcoli.Z120]^3;4)","v":561766.1102},null,"M1_PQ",{"$f":"of:=ROUND(306.0253+385.81691806*[Calcoli.AC116]+0.0107306*[Calcoli.AC120]^2+0.00001236*[Calcoli.AC120]^3;4)","v":562151.9271},null,"M1_PQ",{"$f":"of:=ROUND(306.0253+385.81691806*[Calcoli.AF116]+0.0107306*[Calcoli.AF120]^2+0.00001236*[Calcoli.AF120]^3;4)","v":562537.7441},null,"M1_PQ",{"$f":"of:=ROUND(306.0253+385.81691806*[Calcoli.AI116]+0.0107306*[Calcoli.AI120]^2+0.00001236*[Calcoli.AI120]^3;4)","v":562923.561},null,"M1_PQ",{"$f":"of:=ROUND(306.0253+385.81691806*[Calcoli.AL116]+0.0107306*[Calcoli.AL120]^2+0.00001236*[Calcoli.AL120]^3;4)","v":563309.3779},null,"M1_PQ",{"$f":"of:=ROUND(306.0253+385.81691806*[Calcoli.AO116]+0.0107306*[Calcoli.AO120]^2+0.00001236*[Calcoli.AO120]^3;4)","v":563695.1949}]
["M1_LP",{"$f":"of:=ROUND(306.0253+385.81691806*[Calcoli.B117]+0.0107306*[Calcoli.B121]^2+0.00001236*[Calcoli.B121]^3;4)","v":558776.0289},null,"M1_LP",{"$f":"of:=ROUND(306.0253+385.81691806*[Calcoli.E117]+0.0107306*[Calcoli.E121]^2+0.00001236*[Calcoli.E121]^3;4)","v":559161.8458},null,"M1_LP",{"$f":"of:=ROUND(306.0253+385.81691806*[Calcoli.H117]+0.0107306*[Calcoli.H121]^2+0.00001236*[Calcoli.H121]^3;4)","v":559547.6628},null,"M1_LP",{"$f":"of:=ROUND(306.0253+385.81691806*[Calcoli.K117]+0.0107306*[Calcoli.K121]^2+0.00001236*[Calcoli.K121]^3;4)","v":559933.4797},null,"M1_LP",{"$f":"of:=ROUND(306.0253+385.81691806*[Calcoli.N117]+0.0107306*[Calcoli.N121]^2+0.00001236*[Calcoli.N121]^3;4)","v":560319.2967},null,"M1_LP",{"$f":"of:=ROUND(306.0253+385.81691806*[Calcoli.Q117]+0.0107306*[Calcoli.Q121]^2+0.00001236*[Calcoli.Q121]^3;4)","v":560705.1136},null,"M1_LP",{"$f":"of:=ROUND(306.0253+385.81691806*[Calcoli.T117]+0.0107306*[Calcoli.T121]^2+0.00001236*[Calcoli.T121]^3;4)","v":561090.9305},null,"M1_LP",{"$f":"of:=ROUND(306.0253+385.81691806*[Calcoli.W117]+0.0107306*[Calcoli.W121]^2+0.00001236*[Calcoli.W121]^3;4)","v":561476.7475},null,"M1_LP",{"$f":"of:=ROUND(306.0253+385.81691806*[Calcoli.Z117]+0.0107306*[Calcoli.Z121]^2+0.00001236*[Calcoli.Z121]^3;4)","v":561862.5644},null,"M1_LP",{"$f":"of:=ROUND(306.0253+385.81691806*[Calcoli.AC117]+0.0107306*[Calcoli.AC121]^2+0.00001236*[Calcoli.AC121]^3;4)","v":562248.3814},null,"M1_LP",{"$f":"of:=ROUND(306.0253+385.81691806*[Calcoli.AF117]+0.0107306*[Calcoli.AF121]^2+0.00001236*[Calcoli.AF121]^3;4)","v":562634.1983},null,"M1_LP",{"$f":"of:=ROUND(306.0253+385.81691806*[Calcoli.AI117]+0.0107306*[Calcoli.AI121]^2+0.00001236*[Calcoli.AI121]^3;4)","v":563020.0152},null,"M1_LP",{"$f":"of:=ROUND(306.0253+385.81691806*[Calcoli.AL117]+0.0107306*[Calcoli.AL121]^2+0.00001236*[Calcoli.AL121]^3;4)","v":563405.8322},null,"M1_LP",{"$f":"of:=ROUND(306.0253+385.81691806*[Calcoli.AO117]+0.0107306*[Calcoli.AO121]^2+0.00001236*[Calcoli.AO121]^3;4)","v":563791.6491}]
["M1_UQ",{"$f":"of:=ROUND(306.0253+385.81691806*[Calcoli.B118]+0.0107306*[Calcoli.B122]^2+0.00001236*[Calcoli.B122]^3;4)","v":558872.4831},null,"M1_UQ",{"$f":"of:=ROUND(306.0253+385.81691806*[Calcoli.E118]+0.0107306*[Calcoli.E122]^2+0.00001236*[Calcoli.E122]^3;4)","v":559258.3001},null,"M1_UQ",{"$f":"of:=ROUND(306.0253+385.81691806*[Calcoli.H118]+0.0107306*[Calcoli.H122]^2+0.00001236*[Calcoli.H122]^3;4)","v":559644.117},null,"M1_UQ",{"$f":"of:=ROUND(306.0253+385.81691806*[Calcoli.K118]+0.0107306*[Calcoli.K122]^2+0.00001236*[Calcoli.K122]^3;4)","v":560029.934},null,"M1_UQ",{"$f":"of:=ROUND(306.0253+385.81691806*[Calcoli.N118]+0.0107306*[Calcoli.N122]^2+0.00001236*[Calcoli.N122]^3;4)","v":560415.7509},null,"M1_UQ",{"$f":"of:=ROUND(306.0253+385.81691806*[Calcoli.Q118]+0.0107306*[Calcoli.Q122]^2+0.00001236*[Calcoli.Q122]^3;4)","v":560801.5678},null,"M1_UQ",{"$f":"of:=ROUND(306.0253+385.81691806*[Calcoli.T118]+0.0107306*[Calcoli.T122]^2+0.00001236*[Calcoli.T122]^3;4)","v":561187.3848},null,"M1_UQ",{"$f":"of:=ROUND(306.0253+385.81691806*[Calcoli.W118]+0.0107306*[Calcoli.W122]^2+0.00001236*[Calcoli.W122]^3;4)","v":561573.2017},null,"M1_UQ",{"$f":"of:=ROUND(306.0253+385.81691806*[Calcoli.Z118]+0.0107306*[Calcoli.Z122]^2+0.00001236*[Calcoli.Z122]^3;4)","v":561959.0187},null,"M1_UQ",{"$f":"of:=ROUND(306.0253+385.81691806*[Calcoli.AC118]+0.0107306*[Calcoli.AC122]^2+0.00001236*[Calcoli.AC122]^3;4)","v":562344.8356},null,"M1_UQ",{"$f":"of:=ROUND(306.0253+385.81691806*[Calcoli.AF118]+0.0107306*[Calcoli.AF122]^2+0.00001236*[Calcoli.AF122]^3;4)","v":562730.6525},null,"M1_UQ",{"$f":"of:=ROUND(306.0253+385.81691806*[Calcoli.AI118]+0.0107306*[Calcoli.AI122]^2+0.00001236*[Calcoli.AI122]^3;4)","v":563116.4695},null,"M1_UQ",{"$f":"of:=ROUND(306.0253+385.81691806*[Calcoli.AL118]+0.0107306*[Calcoli.AL122]^2+0.00001236*[Calcoli.AL122]^3;4)","v":563502.2864},null,"M1_UQ",{"$f":"of:=ROUND(306.0253+385.81691806*[Calcoli.AO118]+0.0107306*[Calcoli.AO122]^2+0.00001236*[Calcoli.AO122]^3;4)","v":563888.1033}]
["F_LN",{"$f":"of:=ROUND(21.2964+390.67050646*[Calcoli.B115]-0.0016528*[Calcoli.B119]^2-0.00000239*[Calcoli.B119]^3;4)","v":565321.517},null,"F_LN",{"$f":"of:=ROUND(21.2964+390.67050646*[Calcoli.E115]-0.0016528*[Calcoli.E119]^2-0.00000239*[Calcoli.E119]^3;4)","v":565712.1875},null,"F_LN",{"$f":"of:=ROUND(21.2964+390.67050646*[Calcoli.H115]-0.0016528*[Calcoli.H119]^2-0.00000239*[Calcoli.H119]^3;4)","v":566102.858},null,"F_LN",{"$f":"of:=ROUND(21.2964+390.67050646*[Calcoli.K115]-0.0016528*[Calcoli.K119]^2-0.00000239*[Calcoli.K119]^3;4)","v":566493.5285},null,"F_LN",{"$f":"of:=ROUND(21.2964+390.67050646*[Calcoli.N115]-0.0016528*[Calcoli.N119]^2-0.00000239*[Calcoli.N119]^3;4)","v":566884.199},null,"F_LN",{"$f":"of:=ROUND(21.2964+390.67050646*[Calcoli.Q115]-0.0016528*[Calcoli.Q119]^2-0.00000239*[Calcoli.Q119]^3;4)","v":567274.8695},null,"F_LN",{"$f":"of:=ROUND(21.2964+390.67050646*[Calcoli.T115]-0.0016528*[Calcoli.T119]^2-0.00000239*[Calcoli.T119]^3;4)","v":567665.54},null,"F_LN",{"$f":"of:=ROUND(21.2964+390.67050646*[Calcoli.W115]-0.0016528*[Calcoli.W119]^2-0.00000239*[Calcoli.W119]^3;4)","v":568056.2105},null,"F_LN",{"$f":"of:=ROUND(21.2964+390.67050646*[Calcoli.Z115]-0.0016528*[Calcoli.Z119]^2-0.00000239*[Calcoli.Z119]^3;4)","v":568446.881},null,"F_LN",{"$f":"of:=ROUND(21.2964+390.67050646*[Calcoli.AC115]-0.0016528*[Calcoli.AC119]^2-0.00000239*[Calcoli.AC119]^3;4)","v":568837.5515},null,"F_LN",{"$f":"of:=ROUND(21.2964+390.67050646*[Calcoli.AF115]-0.0016528*[Calcoli.AF119]^2-0.00000239*[Calcoli.AF119]^3;4)","v":569228.222},null,"F_LN",{"$f":"of:=ROUND(21.2964+390.67050646*[Calcoli.AI115]-0.0016528*[Calcoli.AI119]^2-0.00000239*[Calcoli.AI119]^3;4)","v":569618.8925},null,"F_LN",{"$f":"of:=ROUND(21.2964+390.67050646*[Calcoli.AL115]-0.0016528*[Calcoli.AL119]^2-0.00000239*[Calcoli.AL119]^3;4)","v":570009.563},null,"F_LN",{"$f":"of:=ROUND(21.2964+390.67050646*[Calcoli.AO115]-0.0016528*[Calcoli.AO119]^2-0.00000239*[Calcoli.AO119]^3;4)","v":570400.2335}]
["F_a",{"$f":"of:=ROUND(INT([Calcoli.B137])-(INT(INT([Calcoli.B137])/360))*360+[Calcoli.B137]-INT([Calcoli.B137]);4)","v":121.517},null,"F_a",{"$f":"of:=ROUND(INT([Calcoli.E137])-(INT(INT([Calcoli.E137])/360))*360+[Calcoli.E137]-INT([Calcoli.E137]);4)","v":152.1875},null,"F_a",{"$f":"of:=ROUND(INT([Calcoli.H137])-(INT(INT([Calcoli.H137])/360))*360+[Calcoli.H137]-INT([Calcoli.H137]);4)","v":182.858},null,"F_a",{"$f":"of:=ROUND(INT([Calcoli.K137])-(INT(INT([Calcoli.K137])/360))*360+[Calcoli.K137]-INT([Calcoli.K137]);4)","v":213.5285},null,"F_a",{"$f":"of:=ROUND(INT([Calcoli.N137])-(INT(INT([Calcoli.N137])/360))*360+[Calcoli.N137]-INT([Calcoli.N137]);4)","v":244.199},null,"F_a",{"$f":"of:=ROUND(INT([Calcoli.Q137])-(INT(INT([Calcoli.Q137])/360))*360+[Calcoli.Q137]-INT([Calcoli.Q137]);4)","v":274.8695},null,"F_a",{"$f":"of:=ROUND(INT([Calcoli.T137])-(INT(INT([Calcoli.T137])/360))*360+[Calcoli.T137]-INT([Calcoli.T137]);4)","v":305.54},null,"F_a",{"$f":"of:=ROUND(INT([Calcoli.W137])-(INT(INT([Calcoli.W137])/360))*360+[Calcoli.W137]-INT([Calcoli.W137]);4)","v":336.2105},null,"F_a",{"$f":"of:=ROUND(INT([Calcoli.Z137])-(INT(INT([Calcoli.Z137])/360))*360+[Calcoli.Z137]-INT([Calcoli.Z137]);4)","v":6.881},null,"F_a",{"$f":"of:=ROUND(INT([Calcoli.AC137])-(INT(INT([Calcoli.AC137])/360))*360+[Calcoli.AC137]-INT([Calcoli.AC137]);4)","v":37.5515},null,"F_a",{"$f":"of:=ROUND(INT([Calcoli.AF137])-(INT(INT([Calcoli.AF137])/360))*360+[Calcoli.AF137]-INT([Calcoli.AF137]);4)","v":68.222},null,"F_a",{"$f":"of:=ROUND(INT([Calcoli.AI137])-(INT(INT([Calcoli.AI137])/360))*360+[Calcoli.AI137]-INT([Calcoli.AI137]);4)","v":98.8925},null,"F_a",{"$f":"of:=ROUND(INT([Calcoli.AL137])-(INT(INT([Calcoli.AL137])/360))*360+[Calcoli.AL137]-INT([Calcoli.AL137]);4)","v":129.563},null,"F_a",{"$f":"of:=ROUND(INT([Calcoli.AO137])-(INT(INT([Calcoli.AO137])/360))*360+[Calcoli.AO137]-INT([Calcoli.AO137]);4)","v":160.2335}]
["F_PQ",{"$f":"of:=ROUND(21.2964+390.67050646*[Calcoli.B116]-0.0016528*[Calcoli.B120]^2-0.00000239*[Calcoli.B120]^3;4)","v":565419.1846},null,"F_PQ",{"$f":"of:=ROUND(21.2964+390.67050646*[Calcoli.E116]-0.0016528*[Calcoli.E120]^2-0.00000239*[Calcoli.E120]^3;4)","v":565809.8551},null,"F_PQ",{"$f":"of:=ROUND(21.2964+390.67050646*[Calcoli.H116]-0.0016528*[Calcoli.H120]^2-0.00000239*[Calcoli.H120]^3;4)","v":566200.5256},null,"F_PQ",{"$f":"of:=ROUND(21.2964+390.67050646*[Calcoli.K116]-0.0016528*[Calcoli.K120]^2-0.00000239*[Calcoli.K120]^3;4)","v":566591.1961},null,"F_PQ",{"$f":"of:=ROUND(21.2964+390.67050646*[Calcoli.N116]-0.0016528*[Calcoli.N120]^2-0.00000239*[Calcoli.N120]^3;4)","v":566981.8666},null,"F_PQ",{"$f":"of:=ROUND(21.2964+390.67050646*[Calcoli.Q116]-0.0016528*[Calcoli.Q120]^2-0.00000239*[Calcoli.Q120]^3;4)","v":567372.5371},null,"F_PQ",{"$f":"of:=ROUND(21.2964+390.67050646*[Calcoli.T116]-0.0016528*[Calcoli.T120]^2-0.00000239*[Calcoli.T120]^3;4)","v":567763.2076},null,"F_PQ",{"$f":"of:=ROUND(21.2964+390.67050646*[Calcoli.W116]-0.0016528*[Calcoli.W120]^2-0.00000239*[Calcoli.W120]^3;4)","v":568153.8781},null,"F_PQ",{"$f":"of:=ROUND(21.2964+390.67050646*[Calcoli.Z116]-0.0016528*[Calcoli.Z120]^2-0.00000239*[Calcoli.Z120]^3;4)","v":568544.5486},null,"F_PQ",{"$f":"of:=ROUND(21.2964+390.67050646*[Calcoli.AC116]-0.0016528*[Calcoli.AC120]^2-0.00000239*[Calcoli.AC120]^3;4)","v":568935.2191},null,"F_PQ",{"$f":"of:=ROUND(21.2964+390.67050646*[Calcoli.AF116]-0.0016528*[Calcoli.AF120]^2-0.00000239*[Calcoli.AF120]^3;4)","v":569325.8896},null,"F_PQ",{"$f":"of:=ROUND(21.2964+390.67050646*[Calcoli.AI116]-0.0016528*[Calcoli.AI120]^2-0.00000239*[Calcoli.AI120]^3;4)","v":569716.5601},null,"F_PQ",{"$f":"of:=ROUND(21.2964+390.67050646*[Calcoli.AL116]-0.0016528*[Calcoli.AL120]^2-0.00000239*[Calcoli.AL120]^3;4)","v":570107.2306},null,"F_PQ",{"$f":"of:=ROUND(21.2964+390.67050646*[Calcoli.AO116]-0.0016528*[Calcoli.AO120]^2-0.00000239*[Calcoli.AO120]^3;4)","v":570497.9012}]
["F_LP",{"$f":"of:=ROUND(21.2964+390.67050646*[Calcoli.B117]-0.0016528*[Calcoli.B121]^2-0.00000239*[Calcoli.B121]^3;4)","v":565516.8522},null,"F_LP",{"$f":"of:=ROUND(21.2964+390.67050646*[Calcoli.E117]-0.0016528*[Calcoli.E121]^2-0.00000239*[Calcoli.E121]^3;4)","v":565907.5227},null,"F_LP",{"$f":"of:=ROUND(21.2964+390.67050646*[Calcoli.H117]-0.0016528*[Calcoli.H121]^2-0.00000239*[Calcoli.H121]^3;4)","v":566298.1932},null,"F_LP",{"$f":"of:=ROUND(21.2964+390.67050646*[Calcoli.K117]-0.0016528*[Calcoli.K121]^2-0.00000239*[Calcoli.K121]^3;4)","v":566688.8637},null,"F_LP",{"$f":"of:=ROUND(21.2964+390.67050646*[Calcoli.N117]-0.0016528*[Calcoli.N121]^2-0.00000239*[Calcoli.N121]^3;4)","v":567079.5342},null,"F_LP",{"$f":"of:=ROUND(21.2964+390.67050646*[Calcoli.Q117]-0.0016528*[Calcoli.Q121]^2-0.00000239*[Calcoli.Q121]^3;4)","v":567470.2047},null,"F_LP",{"$f":"of:=ROUND(21.2964+390.67050646*[Calcoli.T117]-0.0016528*[Calcoli.T121]^2-0.00000239*[Calcoli.T121]^3;4)","v":567860.8753},null,"F_LP",{"$f":"of:=ROUND(21.2964+390.67050646*[Calcoli.W117]-0.0016528*[Calcoli.W121]^2-0.00000239*[Calcoli.W121]^3;4)","v":568251.5458},null,"F_LP",{"$f":"of:=ROUND(21.2964+390.67050646*[Calcoli.Z117]-0.0016528*[Calcoli.Z121]^2-0.00000239*[Calcoli.Z121]^3;4)","v":568642.2163},null,"F_LP",{"$f":"of:=ROUND(21.2964+390.67050646*[Calcoli.AC117]-0.0016528*[Calcoli.AC121]^2-0.00000239*[Calcoli.AC121]^3;4)","v":569032.8868},null,"F_LP",{"$f":"of:=ROUND(21.2964+390.67050646*[Calcoli.AF117]-0.0016528*[Calcoli.AF121]^2-0.00000239*[Calcoli.AF121]^3;4)","v":569423.5573},null,"F_LP",{"$f":"of:=ROUND(21.2964+390.67050646*[Calcoli.AI117]-0.0016528*[Calcoli.AI121]^2-0.00000239*[Calcoli.AI121]^3;4)","v":569814.2278},null,"F_LP",{"$f":"of:=ROUND(21.2964+390.67050646*[Calcoli.AL117]-0.0016528*[Calcoli.AL121]^2-0.00000239*[Calcoli.AL121]^3;4)","v":570204.8983},null,"F_LP",{"$f":"of:=ROUND(21.2964+390.67050646*[Calcoli.AO117]-0.0016528*[Calcoli.AO121]^2-0.00000239*[Calcoli.AO121]^3;4)","v":570595.5688}]
["F_UQ",{"$f":"of:=ROUND(21.2964+390.67050646*[Calcoli.B118]-0.0016528*[Calcoli.B122]^2-0.00000239*[Calcoli.B122]^3;4)","v":565614.5199},null,"F_UQ",{"$f":"of:=ROUND(21.2964+390.67050646*[Calcoli.E118]-0.0016528*[Calcoli.E122]^2-0.00000239*[Calcoli.E122]^3;4)","v":566005.1904},null,"F_UQ",{"$f":"of:=ROUND(21.2964+390.67050646*[Calcoli.H118]-0.0016528*[Calcoli.H122]^2-0.00000239*[Calcoli.H122]^3;4)","v":566395.8609},null,"F_UQ",{"$f":"of:=ROUND(21.2964+390.67050646*[Calcoli.K118]-0.0016528*[Calcoli.K122]^2-0.00000239*[Calcoli.K122]^3;4)","v":566786.5314},null,"F_UQ",{"$f":"of:=ROUND(21.2964+390.67050646*[Calcoli.N118]-0.0016528*[Calcoli.N122]^2-0.00000239*[Calcoli.N122]^3;4)","v":567177.2019},null,"F_UQ",{"$f":"of:=ROUND(21.2964+390.67050646*[Calcoli.Q118]-0.0016528*[Calcoli.Q122]^2-0.00000239*[Calcoli.Q122]^3;4)","v":567567.8724},null,"F_UQ",{"$f":"of:=ROUND(21.2964+390.67050646*[Calcoli.T118]-0.0016528*[Calcoli.T122]^2-0.00000239*[Calcoli.T122]^3;4)","v":567958.5429},null,"F_UQ",{"$f":"of:=ROUND(21.2964+390.67050646*[Calcoli.W118]-0.0016528*[Calcoli.W122]^2-0.00000239*[Calcoli.W122]^3;4)","v":568349.2134},null,"F_UQ",{"$f":"of:=ROUND(21.2964+390.67050646*[Calcoli.Z118]-0.0016528*[Calcoli.Z122]^2-0.00000239*[Calcoli.Z122]^3;4)","v":568739.8839},null,"F_UQ",{"$f":"of:=ROUND(21.2964+390.67050646*[Calcoli.AC118]-0.0016528*[Calcoli.AC122]^2-0.00000239*[Calcoli.AC122]^3;4)","v":569130.5544},null,"F_UQ",{"$f":"of:=ROUND(21.2964+390.67050646*[Calcoli.AF118]-0.0016528*[Calcoli.AF122]^2-0.00000239*[Calcoli.AF122]^3;4)","v":569521.2249},null,"F_UQ",{"$f":"of:=ROUND(21.2964+390.67050646*[Calcoli.AI118]-0.0016528*[Calcoli.AI122]^2-0.00000239*[Calcoli.AI122]^3;4)","v":569911.8954},null,"F_UQ",{"$f":"of:=ROUND(21.2964+390.67050646*[Calcoli.AL118]-0.0016528*[Calcoli.AL122]^2-0.00000239*[Calcoli.AL122]^3;4)","v":570302.5659},null,"F_UQ",{"$f":"of:=ROUND(21.2964+390.67050646*[Calcoli.AO118]-0.0016528*[Calcoli.AO122]^2-0.00000239*[Calcoli.AO122]^3;4)","v":570693.2364}]
["Corr_LN",{"$f":"of:=ROUND((0.1734-0.000393*[Calcoli.B119])*SIN(RADIANS([Calcoli.B127]))+0.0021*SIN(RADIANS(2*[Calcoli.B127]))-0.4068*SIN(RADIANS([Calcoli.B132]))+0.0161*SIN(RADIANS(2*[Calcoli.B132]))-0.0004*SIN(RADIANS(3*[Calcoli.B132]))+0.0104*SIN(RADIANS(2*[Calcoli.B137]))-0.0051*SIN(RADIANS([Calcoli.B127]+[Calcoli.B132]))-0.0074*SIN(RADIANS([Calcoli.B127]-[Calcoli.B132]))+0.0004*SIN(RADIANS(2*[Calcoli.B137]+[Calcoli.B127]))-0.0004*SIN(RADIANS(2*[Calcoli.B137]-[Calcoli.B127]))-0.0006*SIN(RADIANS(2*[Calcoli.B137]+[Calcoli.B132]))+0.001*SIN(RADIANS(2*[Calcoli.B137]-[Calcoli.B132]))+0.0005*SIN(RADIANS([Calcoli.B127]+2*[Calcoli.B132]));4)","v":0.2666},null,"Corr_LN",{"$f":"of:=ROUND((0.1734-0.000393*[Calcoli.E119])*SIN(RADIANS([Calcoli.E127]))+0.0021*SIN(RADIANS(2*[Calcoli.E127]))-0.4068*SIN(RADIANS([Calcoli.E132]))+0.0161*SIN(RADIANS(2*[Calcoli.E132]))-0.0004*SIN(RADIANS(3*[Calcoli.E132]))+0.0104*SIN(RADIANS(2*[Calcoli.E137]))-0.0051*SIN(RADIANS([Calcoli.E127]+[Calcoli.E132]))-0.0074*SIN(RADIANS([Calcoli.E127]-[Calcoli.E132]))+0.0004*SIN(RADIANS(2*[Calcoli.E137]+[Calcoli.E127]))-0.0004*SIN(RADIANS(2*[Calcoli.E137]-[Calcoli.E127]))-0.0006*SIN(RADIANS(2*[Calcoli.E137]+[Calcoli.E132]))+0.001*SIN(RADIANS(2*[Calcoli.E137]-[Calcoli.E132]))+0.0005*SIN(RADIANS([Calcoli.E127]+2*[Calcoli.E132]));4)","v":0.4541},null,"Corr_LN",{"$f":"of:=ROUND((0.1734-0.000393*[Calcoli.H119])*SIN(RADIANS([Calcoli.H127]))+0.0021*SIN(RADIANS(2*[Calcoli.H127]))-0.4068*SIN(RADIANS([Calcoli.H132]))+0.0161*SIN(RADIANS(2*[Calcoli.H132]))-0.0004*SIN(RADIANS(3*[Calcoli.H132]))+0.0104*SIN(RADIANS(2*[Calcoli.H137]))-0.0051*SIN(RADIANS([Calcoli.H127]+[Calcoli.H132]))-0.0074*SIN(RADIANS([Calcoli.H127]-[Calcoli.H132]))+0.0004*SIN(RADIANS(2*[Calcoli.H137]+[Calcoli.H127]))-0.0004*SIN(RADIANS(2*[Calcoli.H137]-[Calcoli.H127]))-0.0006*SIN(RADIANS(2*[Calcoli.H137]+[Calcoli.H132]))+0.001*SIN(RADIANS(2*[Calcoli.H137]-[Calcoli.H132]))+0.0005*SIN(RADIANS([Calcoli.H127]+2*[Calcoli.H132]));4)","v":0.5429},null,"Corr_LN",{"$f":"of:=ROUND((0.1734-0.000393*[Calcoli.K119])*SIN(RADIANS([Calcoli.K127]))+0.0021*SIN(RADIANS(2*[Calcoli.K127]))-0.4068*SIN(RADIANS([Calcoli.K132]))+0.0161*SIN(RADIANS(2*[Calcoli.K132]))-0.0004*SIN(RADIANS(3*[Calcoli.K132]))+0.0104*SIN(RADIANS(2*[Calcoli.K137]))-0.0051*SIN(RADIANS([Calcoli.K127]+[Calcoli.K132]))-0.0074*SIN(RADIANS([Calcoli.K127]-[Calcoli.K132]))+0.0004*SIN(RADIANS(2*[Calcoli.K137]+[Calcoli.K127]))-0.0004*SIN(RADIANS(2*[Calcoli.K137]-[Calcoli.K127]))-0.0006*SIN(RADIANS(2*[Calcoli.K137]+[Calcoli.K132]))+0.001*SIN(RADIANS(2*[Calcoli.K137]-[Calcoli.K132]))+0.0005*SIN(RADIANS([Calcoli.K127]+2*[Calcoli.K132]));4)","v":0.5117},null,"Corr_LN",{"$f":"of:=ROUND((0.1734-0.000393*[Calcoli.N119])*SIN(RADIANS([Calcoli.N127]))+0.0021*SIN(RADIANS(2*[Calcoli.N127]))-0.4068*SIN(RADIANS([Calcoli.N132]))+0.0161*SIN(RADIANS(2*[Calcoli.N132]))-0.0004*SIN(RADIANS(3*[Calcoli.N132]))+0.0104*SIN(RADIANS(2*[Calcoli.N137]))-0.0051*SIN(RADIANS([Calcoli.N127]+[Calcoli.N132]))-0.0074*SIN(RADIANS([Calcoli.N127]-[Calcoli.N132]))+0.0004*SIN(RADIANS(2*[Calcoli.N137]+[Calcoli.N127]))-0.0004*SIN(RADIANS(2*[Calcoli.N137]-[Calcoli.N127]))-0.0006*SIN(RADIANS(2*[Calcoli.N137]+[Calcoli.N132]))+0.001*SIN(RADIANS(2*[Calcoli.N137]-[Calcoli.N132]))+0.0005*SIN(RADIANS([Calcoli.N127]+2*[Calcoli.N132]));4)","v":0.3692},null,"Corr_LN",{"$f":"of:=ROUND((0.1734-0.000393*[Calcoli.Q119])*SIN(RADIANS([Calcoli.Q127]))+0.0021*SIN(RADIANS(2*[Calcoli.Q127]))-0.4068*SIN(RADIANS([Calcoli.Q132]))+0.0161*SIN(RADIANS(2*[Calcoli.Q132]))-0.0004*SIN(RADIANS(3*[Calcoli.Q132]))+0.0104*SIN(RADIANS(2*[Calcoli.Q137]))-0.0051*SIN(RADIANS([Calcoli.Q127]+[Calcoli.Q132]))-0.0074*SIN(RADIANS([Calcoli.Q127]-[Calcoli.Q132]))+0.0004*SIN(RADIANS(2*[Calcoli.Q137]+[Calcoli.Q127]))-0.0004*SIN(RADIANS(2*[Calcoli.Q137]-[Calcoli.Q127]))-0.0006*SIN(RADIANS(2*[Calcoli.Q137]+[Calcoli.Q132]))+0.001*SIN(RADIANS(2*[Calcoli.Q137]-[Calcoli.Q132]))+0.0005*SIN(RADIANS([Calcoli.Q127]+2*[Calcoli.Q132]));4)","v":0.1498},null,"Corr_LN",{"$f":"of:=ROUND((0.1734-0.000393*[Calcoli.T119])*SIN(RADIANS([Calcoli.T127]))+0.0021*SIN(RADIANS(2*[Calcoli.T127]))-0.4068*SIN(RADIANS([Calcoli.T132]))+0.0161*SIN(RADIANS(2*[Calcoli.T132]))-0.0004*SIN(RADIANS(3*[Calcoli.T132]))+0.0104*SIN(RADIANS(2*[Calcoli.T137]))-0.0051*SIN(RADIANS([Calcoli.T127]+[Calcoli.T132]))-0.0074*SIN(RADIANS([Calcoli.T127]-[Calcoli.T132]))+0.0004*SIN(RADIANS(2*[Calcoli.T137]+[Calcoli.T127]))-0.0004*SIN(RADIANS(2*[Calcoli.T137]-[Calcoli.T127]))-0.0006*SIN(RADIANS(2*[Calcoli.T137]+[Calcoli.T132]))+0.001*SIN(RADIANS(2*[Calcoli.T137]-[Calcoli.T132]))+0.0005*SIN(RADIANS([Calcoli.T127]+2*[Calcoli.T132]));4)","v":-0.0986},null,"Corr_LN",{"$f":"of:=ROUND((0.1734-0.000393*[Calcoli.W119])*SIN(RADIANS([Calcoli.W127]))+0.0021*SIN(RADIANS(2*[Calcoli.W127]))-0.4068*SIN(RADIANS([Calcoli.W132]))+0.0161*SIN(RADIANS(2*[Calcoli.W132]))-0.0004*SIN(RADIANS(3*[Calcoli.W132]))+0.0104*SIN(RADIANS(2*[Calcoli.W137]))-0.0051*SIN(RADIANS([Calcoli.W127]+[Calcoli.W132]))-0.0074*SIN(RADIANS([Calcoli.W127]-[Calcoli.W132]))+0.0004*SIN(RADIANS(2*[Calcoli.W137]+[Calcoli.W127]))-0.0004*SIN(RADIANS(2*[Calcoli.W137]-[Calcoli.W127]))-0.0006*SIN(RADIANS(2*[Calcoli.W137]+[Calcoli.W132]))+0.001*SIN(RADIANS(2*[Calcoli.W137]-[Calcoli.W132]))+0.0005*SIN(RADIANS([Calcoli.W127]+2*[Calcoli.W132]));4)","v":-0.3273},null,"Corr_LN",{"$f":"of:=ROUND((0.1734-0.000393*[Calcoli.Z119])*SIN(RADIANS([Calcoli.Z127]))+0.0021*SIN(RADIANS(2*[Calcoli.Z127]))-0.4068*SIN(RADIANS([Calcoli.Z132]))+0.0161*SIN(RADIANS(2*[Calcoli.Z132]))-0.0004*SIN(RADIANS(3*[Calcoli.Z132]))+0.0104*SIN(RADIANS(2*[Calcoli.Z137]))-0.0051*SIN(RADIANS([Calcoli.Z127]+[Calcoli.Z132]))-0.0074*SIN(RADIANS([Calcoli.Z127]-[Calcoli.Z132]))+0.0004*SIN(RADIANS(2*[Calcoli.Z137]+[Calcoli.Z127]))-0.0004*SIN(RADIANS(2*[Calcoli.Z137]-[Calcoli.Z127]))-0.0006*SIN(RADIANS(2*[Calcoli.Z137]+[Calcoli.Z132]))+0.001*SIN(RADIANS(2*[Calcoli.Z137]-[Calcoli.Z132]))+0.0005*SIN(RADIANS([Calcoli.Z127]+2*[Calcoli.Z132]));4)","v":-0.4939},null,"Corr_LN",{"$f":"of:=ROUND((0.1734-0.000393*[Calcoli.AC119])*SIN(RADIANS([Calcoli.AC127]))+0.0021*SIN(RADIANS(2*[Calcoli.AC127]))-0.4068*SIN(RADIANS([Calcoli.AC132]))+0.0161*SIN(RADIANS(2*[Calcoli.AC132]))-0.0004*SIN(RADIANS(3*[Calcoli.AC132]))+0.0104*SIN(RADIANS(2*[Calcoli.AC137]))-0.0051*SIN(RADIANS([Calcoli.AC127]+[Calcoli.AC132]))-0.0074*SIN(RADIANS([Calcoli.AC127]-[Calcoli.AC132]))+0.0004*SIN(RADIANS(2*[Calcoli.AC137]+[Calcoli.AC127]))-0.0004*SIN(RADIANS(2*[Calcoli.AC137]-[Calcoli.AC127]))-0.0006*SIN(RADIANS(2*[Calcoli.AC137]+[Calcoli.AC132]))+0.001*SIN(RADIANS(2*[Calcoli.AC137]-[Calcoli.AC132]))+0.0005*SIN(RADIANS([Calcoli.AC127]+2*[Calcoli.AC132]));4)","v":-0.5667},null,"Corr_LN",{"$f":"of:=ROUND((0.1734-0.000393*[Calcoli.AF119])*SIN(RADIANS([Calcoli.AF127]))+0.0021*SIN(RADIANS(2*[Calcoli.AF127]))-0.4068*SIN(RADIANS([Calcoli.AF132]))+0.0161*SIN(RADIANS(2*[Calcoli.AF132]))-0.0004*SIN(RADIANS(3*[Calcoli.AF132]))+0.0104*SIN(RADIANS(2*[Calcoli.AF137]))-0.0051*SIN(RADIANS([Calcoli.AF127]+[Calcoli.AF132]))-0.0074*SIN(RADIANS([Calcoli.AF127]-[Calcoli.AF132]))+0.0004*SIN(RADIANS(2*[Calcoli.AF137]+[Calcoli.AF127]))-0.0004*SIN(RADIANS(2*[Calcoli.AF137]-[Calcoli.AF127]))-0.0006*SIN(RADIANS(2*[Calcoli.AF137]+[Calcoli.AF132]))+0.001*SIN(RADIANS(2*[Calcoli.AF137]-[Calcoli.AF132]))+0.0005*SIN(RADIANS([Calcoli.AF127]+2*[Calcoli.AF132]));4)","v":-0.5266},null,"Corr_LN",{"$f":"of:=ROUND((0.1734-0.000393*[Calcoli.AI119])*SIN(RADIANS([Calcoli.AI127]))+0.0021*SIN(RADIANS(2*[Calcoli.AI127]))-0.4068*SIN(RADIANS([Calcoli.AI132]))+0.0161*SIN(RADIANS(2*[Calcoli.AI132]))-0.0004*SIN(RADIANS(3*[Calcoli.AI132]))+0.0104*SIN(RADIANS(2*[Calcoli.AI137]))-0.0051*SIN(RADIANS([Calcoli.AI127]+[Calcoli.AI132]))-0.0074*SIN(RADIANS([Calcoli.AI127]-[Calcoli.AI132]))+0.0004*SIN(RADIANS(2*[Calcoli.AI137]+[Calcoli.AI127]))-0.0004*SIN(RADIANS(2*[Calcoli.AI137]-[Calcoli.AI127]))-0.0006*SIN(RADIANS(2*[Calcoli.AI137]+[Calcoli.AI132]))+0.001*SIN(RADIANS(2*[Calcoli.AI137]-[Calcoli.AI132]))+0.0005*SIN(RADIANS([Calcoli.AI127]+2*[Calcoli.AI132]));4)","v":-0.3695},null,"Corr_LN",{"$f":"of:=ROUND((0.1734-0.000393*[Calcoli.AL119])*SIN(RADIANS([Calcoli.AL127]))+0.0021*SIN(RADIANS(2*[Calcoli.AL127]))-0.4068*SIN(RADIANS([Calcoli.AL132]))+0.0161*SIN(RADIANS(2*[Calcoli.AL132]))-0.0004*SIN(RADIANS(3*[Calcoli.AL132]))+0.0104*SIN(RADIANS(2*[Calcoli.AL137]))-0.0051*SIN(RADIANS([Calcoli.AL127]+[Calcoli.AL132]))-0.0074*SIN(RADIANS([Calcoli.AL127]-[Calcoli.AL132]))+0.0004*SIN(RADIANS(2*[Calcoli.AL137]+[Calcoli.AL127]))-0.0004*SIN(RADIANS(2*[Calcoli.AL137]-[Calcoli.AL127]))-0.0006*SIN(RADIANS(2*[Calcoli.AL137]+[Calcoli.AL132]))+0.001*SIN(RADIANS(2*[Calcoli.AL137]-[Calcoli.AL132]))+0.0005*SIN(RADIANS([Calcoli.AL127]+2*[Calcoli.AL132]));4)","v":-0.1163},null,"Corr_LN",{"$f":"of:=ROUND((0.1734-0.000393*[Calcoli.AO119])*SIN(RADIANS([Calcoli.AO127]))+0.0021*SIN(RADIANS(2*[Calcoli.AO127]))-0.4068*SIN(RADIANS([Calcoli.AO132]))+0.0161*SIN(RADIANS(2*[Calcoli.AO132]))-0.0004*SIN(RADIANS(3*[Calcoli.AO132]))+0.0104*SIN(RADIANS(2*[Calcoli.AO137]))-0.0051*SIN(RADIANS([Calcoli.AO127]+[Calcoli.AO132]))-0.0074*SIN(RADIANS([Calcoli.AO127]-[Calcoli.AO132]))+0.0004*SIN(RADIANS(2*[Calcoli.AO137]+[Calcoli.AO127]))-0.0004*SIN(RADIANS(2*[Calcoli.AO137]-[Calcoli.AO127]))-0.0006*SIN(RADIANS(2*[Calcoli.AO137]+[Calcoli.AO132]))+0.001*SIN(RADIANS(2*[Calcoli.AO137]-[Calcoli.AO132]))+0.0005*SIN(RADIANS([Calcoli.AO127]+2*[Calcoli.AO132]));4)","v":0.1773}]
["Corr_PQ",{"$f":"of:=ROUND((0.1721-0.0004*[Calcoli.B120])*SIN(RADIANS([Calcoli.B129]))+0.0021*SIN(RADIANS(2*[Calcoli.B129]))-0.628*SIN(RADIANS([Calcoli.B134]))+0.0089*SIN(RADIANS(2*[Calcoli.B134]))-0.0004*SIN(RADIANS(3*[Calcoli.B134]))+0.0079*SIN(RADIANS(2*[Calcoli.B139]))-0.0119*SIN(RADIANS([Calcoli.B129]+[Calcoli.B134]))-0.0047*SIN(RADIANS([Calcoli.B129]-[Calcoli.B134]))+0.0003*SIN(RADIANS(2*[Calcoli.B139]+[Calcoli.B129]))-0.0004*SIN(RADIANS(2*[Calcoli.B139]-[Calcoli.B129]))-0.0006*SIN(RADIANS(2*[Calcoli.B139]+[Calcoli.B134]))+0.0021*SIN(RADIANS(2*[Calcoli.B139]-[Calcoli.B134]))+0.0003*SIN(RADIANS([Calcoli.B129]+2*[Calcoli.B134]))+0.0004*SIN(RADIANS([Calcoli.B129]-2*[Calcoli.B134]))-0.0003*SIN(RADIANS(2*[Calcoli.B129]+[Calcoli.B134]));4)","v":0.4184},null,"Corr_PQ",{"$f":"of:=ROUND((0.1721-0.0004*[Calcoli.E120])*SIN(RADIANS([Calcoli.E129]))+0.0021*SIN(RADIANS(2*[Calcoli.E129]))-0.628*SIN(RADIANS([Calcoli.E134]))+0.0089*SIN(RADIANS(2*[Calcoli.E134]))-0.0004*SIN(RADIANS(3*[Calcoli.E134]))+0.0079*SIN(RADIANS(2*[Calcoli.E139]))-0.0119*SIN(RADIANS([Calcoli.E129]+[Calcoli.E134]))-0.0047*SIN(RADIANS([Calcoli.E129]-[Calcoli.E134]))+0.0003*SIN(RADIANS(2*[Calcoli.E139]+[Calcoli.E129]))-0.0004*SIN(RADIANS(2*[Calcoli.E139]-[Calcoli.E129]))-0.0006*SIN(RADIANS(2*[Calcoli.E139]+[Calcoli.E134]))+0.0021*SIN(RADIANS(2*[Calcoli.E139]-[Calcoli.E134]))+0.0003*SIN(RADIANS([Calcoli.E129]+2*[Calcoli.E134]))+0.0004*SIN(RADIANS([Calcoli.E129]-2*[Calcoli.E134]))-0.0003*SIN(RADIANS(2*[Calcoli.E129]+[Calcoli.E134]));4)","v":0.2433},null,"Corr_PQ",{"$f":"of:=ROUND((0.1721-0.0004*[Calcoli.H120])*SIN(RADIANS([Calcoli.H129]))+0.0021*SIN(RADIANS(2*[Calcoli.H129]))-0.628*SIN(RADIANS([Calcoli.H134]))+0.0089*SIN(RADIANS(2*[Calcoli.H134]))-0.0004*SIN(RADIANS(3*[Calcoli.H134]))+0.0079*SIN(RADIANS(2*[Calcoli.H139]))-0.0119*SIN(RADIANS([Calcoli.H129]+[Calcoli.H134]))-0.0047*SIN(RADIANS([Calcoli.H129]-[Calcoli.H134]))+0.0003*SIN(RADIANS(2*[Calcoli.H139]+[Calcoli.H129]))-0.0004*SIN(RADIANS(2*[Calcoli.H139]-[Calcoli.H129]))-0.0006*SIN(RADIANS(2*[Calcoli.H139]+[Calcoli.H134]))+0.0021*SIN(RADIANS(2*[Calcoli.H139]-[Calcoli.H134]))+0.0003*SIN(RADIANS([Calcoli.H129]+2*[Calcoli.H134]))+0.0004*SIN(RADIANS([Calcoli.H129]-2*[Calcoli.H134]))-0.0003*SIN(RADIANS(2*[Calcoli.H129]+[Calcoli.H134]));4)","v":0.0139},null,"Corr_PQ",{"$f":"of:=ROUND((0.1721-0.0004*[Calcoli.K120])*SIN(RADIANS([Calcoli.K129]))+0.0021*SIN(RADIANS(2*[Calcoli.K129]))-0.628*SIN(RADIANS([Calcoli.K134]))+0.0089*SIN(RADIANS(2*[Calcoli.K134]))-0.0004*SIN(RADIANS(3*[Calcoli.K134]))+0.0079*SIN(RADIANS(2*[Calcoli.K139]))-0.0119*SIN(RADIANS([Calcoli.K129]+[Calcoli.K134]))-0.0047*SIN(RADIANS([Calcoli.K129]-[Calcoli.K134]))+0.0003*SIN(RADIANS(2*[Calcoli.K139]+[Calcoli.K129]))-0.0004*SIN(RADIANS(2*[Calcoli.K139]-[Calcoli.K129]))-0.0006*SIN(RADIANS(2*[Calcoli.K139]+[Calcoli.K134]))+0.0021*SIN(RADIANS(2*[Calcoli.K139]-[Calcoli.K134]))+0.0003*SIN(RADIANS([Calcoli.K129]+2*[Calcoli.K134]))+0.0004*SIN(RADIANS([Calcoli.K129]-2*[Calcoli.K134]))-0.0003*SIN(RADIANS(2*[Calcoli.K129]+[Calcoli.K134]));4)","v":-0.2201},null,"Corr_PQ",{"$f":"of:=ROUND((0.1721-0.0004*[Calcoli.N120])*SIN(RADIANS([Calcoli.N129]))+0.0021*SIN(RADIANS(2*[Calcoli.N129]))-0.628*SIN(RADIANS([Calcoli.N134]))+0.0089*SIN(RADIANS(2*[Calcoli.N134]))-0.0004*SIN(RADIANS(3*[Calcoli.N134]))+0.0079*SIN(RADIANS(2*[Calcoli.N139]))-0.0119*SIN(RADIANS([Calcoli.N129]+[Calcoli.N134]))-0.0047*SIN(RADIANS([Calcoli.N129]-[Calcoli.N134]))+0.0003*SIN(RADIANS(2*[Calcoli.N139]+[Calcoli.N129]))-0.0004*SIN(RADIANS(2*[Calcoli.N139]-[Calcoli.N129]))-0.0006*SIN(RADIANS(2*[Calcoli.N139]+[Calcoli.N134]))+0.0021*SIN(RADIANS(2*[Calcoli.N139]-[Calcoli.N134]))+0.0003*SIN(RADIANS([Calcoli.N129]+2*[Calcoli.N134]))+0.0004*SIN(RADIANS([Calcoli.N129]-2*[Calcoli.N134]))-0.0003*SIN(RADIANS(2*[Calcoli.N129]+[Calcoli.N134]));4)","v":-0.4124},null,"Corr_PQ",{"$f":"of:=ROUND((0.1721-0.0004*[Calcoli.Q120])*SIN(RADIANS([Calcoli.Q129]))+0.0021*SIN(RADIANS(2*[Calcoli.Q129]))-0.628*SIN(RADIANS([Calcoli.Q134]))+0.0089*SIN(RADIANS(2*[Calcoli.Q134]))-0.0004*SIN(RADIANS(3*[Calcoli.Q134]))+0.0079*SIN(RADIANS(2*[Calcoli.Q139]))-0.0119*SIN(RADIANS([Calcoli.Q129]+[Calcoli.Q134]))-0.0047*SIN(RADIANS([Calcoli.Q129]-[Calcoli.Q134]))+0.0003*SIN(RADIANS(2*[Calcoli.Q139]+[Calcoli.Q129]))-0.0004*SIN(RADIANS(2*[Calcoli.Q139]-[Calcoli.Q129]))-0.0006*SIN(RADIANS(2*[Calcoli.Q139]+[Calcoli.Q134]))+0.0021*SIN(RADIANS(2*[Calcoli.Q139]-[Calcoli.Q134]))+0.0003*SIN(RADIANS([Calcoli.Q129]+2*[Calcoli.Q134]))+0.0004*SIN(RADIANS([Calcoli.Q129]-2*[Calcoli.Q134]))-0.0003*SIN(RADIANS(2*[Calcoli.Q129]+[Calcoli.Q134]));4)","v":-0.53},null,"Corr_PQ",{"$f":"of:=ROUND((0.1721-0.0004*[Calcoli.T120])*SIN(RADIANS([Calcoli.T129]))+0.0021*SIN(RADIANS(2*[Calcoli.T129]))-0.628*SIN(RADIANS([Calcoli.T134]))+0.0089*SIN(RADIANS(2*[Calcoli.T134]))-0.0004*SIN(RADIANS(3*[Calcoli.T134]))+0.0079*SIN(RADIANS(2*[Calcoli.T139]))-0.0119*SIN(RADIANS([Calcoli.T129]+[Calcoli.T134]))-0.0047*SIN(RADIANS([Calcoli.T129]-[Calcoli.T134]))+0.0003*SIN(RADIANS(2*[Calcoli.T139]+[Calcoli.T129]))-0.0004*SIN(RADIANS(2*[Calcoli.T139]-[Calcoli.T129]))-0.0006*SIN(RADIANS(2*[Calcoli.T139]+[Calcoli.T134]))+0.0021*SIN(RADIANS(2*[Calcoli.T139]-[Calcoli.T134]))+0.0003*SIN(RADIANS([Calcoli.T129]+2*[Calcoli.T134]))+0.0004*SIN(RADIANS([Calcoli.T129]-2*[Calcoli.T134]))-0.0003*SIN(RADIANS(2*[Calcoli.T129]+[Calcoli.T134]));4)","v":-0.5544},null,"Corr_PQ",{"$f":"of:=ROUND((0.1721-0.0004*[Calcoli.W120])*SIN(RADIANS([Calcoli.W129]))+0.0021*SIN(RADIANS(2*[Calcoli.W129]))-0.628*SIN(RADIANS([Calcoli.W134]))+0.0089*SIN(RADIANS(2*[Calcoli.W134]))-0.0004*SIN(RADIANS(3*[Calcoli.W134]))+0.0079*SIN(RADIANS(2*[Calcoli.W139]))-0.0119*SIN(RADIANS([Calcoli.W129]+[Calcoli.W134]))-0.0047*SIN(RADIANS([Calcoli.W129]-[Calcoli.W134]))+0.0003*SIN(RADIANS(2*[Calcoli.W139]+[Calcoli.W129]))-0.0004*SIN(RADIANS(2*[Calcoli.W139]-[Calcoli.W129]))-0.0006*SIN(RADIANS(2*[Calcoli.W139]+[Calcoli.W134]))+0.0021*SIN(RADIANS(2*[Calcoli.W139]-[Calcoli.W134]))+0.0003*SIN(RADIANS([Calcoli.W129]+2*[Calcoli.W134]))+0.0004*SIN(RADIANS([Calcoli.W129]-2*[Calcoli.W134]))-0.0003*SIN(RADIANS(2*[Calcoli.W129]+[Calcoli.W134]));4)","v":-0.4792},null,"Corr_PQ",{"$f":"of:=ROUND((0.1721-0.0004*[Calcoli.Z120])*SIN(RADIANS([Calcoli.Z129]))+0.0021*SIN(RADIANS(2*[Calcoli.Z129]))-0.628*SIN(RADIANS([Calcoli.Z134]))+0.0089*SIN(RADIANS(2*[Calcoli.Z134]))-0.0004*SIN(RADIANS(3*[Calcoli.Z134]))+0.0079*SIN(RADIANS(2*[Calcoli.Z139]))-0.0119*SIN(RADIANS([Calcoli.Z129]+[Calcoli.Z134]))-0.0047*SIN(RADIANS([Calcoli.Z129]-[Calcoli.Z134]))+0.0003*SIN(RADIANS(2*[Calcoli.Z139]+[Calcoli.Z129]))-0.0004*SIN(RADIANS(2*[Calcoli.Z139]-[Calcoli.Z129]))-0.0006*SIN(RADIANS(2*[Calcoli.Z139]+[Calcoli.Z134]))+0.0021*SIN(RADIANS(2*[Calcoli.Z139]-[Calcoli.Z134]))+0.0003*SIN(RADIANS([Calcoli.Z129]+2*[Calcoli.Z134]))+0.0004*SIN(RADIANS([Calcoli.Z129]-2*[Calcoli.Z134]))-0.0003*SIN(RADIANS(2*[Calcoli.Z129]+[Calcoli.Z134]));4)","v":-0.3079},null,"Corr_PQ",{"$f":"of:=ROUND((0.1721-0.0004*[Calcoli.AC120])*SIN(RADIANS([Calcoli.AC129]))+0.0021*SIN(RADIANS(2*[Calcoli.AC129]))-0.628*SIN(RADIANS([Calcoli.AC134]))+0.0089*SIN(RADIANS(2*[Calcoli.AC134]))-0.0004*SIN(RADIANS(3*[Calcoli.AC134]))+0.0079*SIN(RADIANS(2*[Calcoli.AC139]))-0.0119*SIN(RADIANS([Calcoli.AC129]+[Calcoli.AC134]))-0.0047*SIN(RADIANS([Calcoli.AC129]-[Calcoli.AC134]))+0.0003*SIN(RADIANS(2*[Calcoli.AC139]+[Calcoli.AC129]))-0.0004*SIN(RADIANS(2*[Calcoli.AC139]-[Calcoli.AC129]))-0.0006*SIN(RADIANS(2*[Calcoli.AC139]+[Calcoli.AC134]))+0.0021*SIN(RADIANS(2*[Calcoli.AC139]-[Calcoli.AC134]))+0.0003*SIN(RADIANS([Calcoli.AC129]+2*[Calcoli.AC134]))+0.0004*SIN(RADIANS([Calcoli.AC129]-2*[Calcoli.AC134]))-0.0003*SIN(RADIANS(2*[Calcoli.AC129]+[Calcoli.AC134]));4)","v":-0.06},null,"Corr_PQ",{"$f":"of:=ROUND((0.1721-0.0004*[Calcoli.AF120])*SIN(RADIANS([Calcoli.AF129]))+0.0021*SIN(RADIANS(2*[Calcoli.AF129]))-0.628*SIN(RADIANS([Calcoli.AF134]))+0.0089*SIN(RADIANS(2*[Calcoli.AF134]))-0.0004*SIN(RADIANS(3*[Calcoli.AF134]))+0.0079*SIN(RADIANS(2*[Calcoli.AF139]))-0.0119*SIN(RADIANS([Calcoli.AF129]+[Calcoli.AF134]))-0.0047*SIN(RADIANS([Calcoli.AF129]-[Calcoli.AF134]))+0.0003*SIN(RADIANS(2*[Calcoli.AF139]+[Calcoli.AF129]))-0.0004*SIN(RADIANS(2*[Calcoli.AF139]-[Calcoli.AF129]))-0.0006*SIN(RADIANS(2*[Calcoli.AF139]+[Calcoli.AF134]))+0.0021*SIN(RADIANS(2*[Calcoli.AF139]-[Calcoli.AF134]))+0.0003*SIN(RADIANS([Calcoli.AF129]+2*[Calcoli.AF134]))+0.0004*SIN(RADIANS([Calcoli.AF129]-2*[Calcoli.AF134]))-0.0003*SIN(RADIANS(2*[Calcoli.AF129]+[Calcoli.AF134]));4)","v":0.2208},null,"Corr_PQ",{"$f":"of:=ROUND((0.1721-0.0004*[Calcoli.AI120])*SIN(RADIANS([Calcoli.AI129]))+0.0021*SIN(RADIANS(2*[Calcoli.AI129]))-0.628*SIN(RADIANS([Calcoli.AI134]))+0.0089*SIN(RADIANS(2*[Calcoli.AI134]))-0.0004*SIN(RADIANS(3*[Calcoli.AI134]))+0.0079*SIN(RADIANS(2*[Calcoli.AI139]))-0.0119*SIN(RADIANS([Calcoli.AI129]+[Calcoli.AI134]))-0.0047*SIN(RADIANS([Calcoli.AI129]-[Calcoli.AI134]))+0.0003*SIN(RADIANS(2*[Calcoli.AI139]+[Calcoli.AI129]))-0.0004*SIN(RADIANS(2*[Calcoli.AI139]-[Calcoli.AI129]))-0.0006*SIN(RADIANS(2*[Calcoli.AI139]+[Calcoli.AI134]))+0.0021*SIN(RADIANS(2*[Calcoli.AI139]-[Calcoli.AI134]))+0.0003*SIN(RADIANS([Calcoli.AI129]+2*[Calcoli.AI134]))+0.0004*SIN(RADIANS([Calcoli.AI129]-2*[Calcoli.AI134]))-0.0003*SIN(RADIANS(2*[Calcoli.AI129]+[Calcoli.AI134]));4)","v":0.4682},null,"Corr_PQ",{"$f":"of:=ROUND((0.1721-0.0004*[Calcoli.AL120])*SIN(RADIANS([Calcoli.AL129]))+0.0021*SIN(RADIANS(2*[Calcoli.AL129]))-0.628*SIN(RADIANS([Calcoli.AL134]))+0.0089*SIN(RADIANS(2*[Calcoli.AL134]))-0.0004*SIN(RADIANS(3*[Calcoli.AL134]))+0.0079*SIN(RADIANS(2*[Calcoli.AL139]))-0.0119*SIN(RADIANS([Calcoli.AL129]+[Calcoli.AL134]))-0.0047*SIN(RADIANS([Calcoli.AL129]-[Calcoli.AL134]))+0.0003*SIN(RADIANS(2*[Calcoli.AL139]+[Calcoli.AL129]))-0.0004*SIN(RADIANS(2*[Calcoli.AL139]-[Calcoli.AL129]))-0.0006*SIN(RADIANS(2*[Calcoli.AL139]+[Calcoli.AL134]))+0.0021*SIN(RADIANS(2*[Calcoli.AL139]-[Calcoli.AL134]))+0.0003*SIN(RADIANS([Calcoli.AL129]+2*[Calcoli.AL134]))+0.0004*SIN(RADIANS([Calcoli.AL129]-2*[Calcoli.AL134]))-0.0003*SIN(RADIANS(2*[Calcoli.AL129]+[Calcoli.AL134]));4)","v":0.6159},null,"Corr_PQ",{"$f":"of:=ROUND((0.1721-0.0004*[Calcoli.AO120])*SIN(RADIANS([Calcoli.AO129]))+0.0021*SIN(RADIANS(2*[Calcoli.AO129]))-0.628*SIN(RADIANS([Calcoli.AO134]))+0.0089*SIN(RADIANS(2*[Calcoli.AO134]))-0.0004*SIN(RADIANS(3*[Calcoli.AO134]))+0.0079*SIN(RADIANS(2*[Calcoli.AO139]))-0.0119*SIN(RADIANS([Calcoli.AO129]+[Calcoli.AO134]))-0.0047*SIN(RADIANS([Calcoli.AO129]-[Calcoli.AO134]))+0.0003*SIN(RADIANS(2*[Calcoli.AO139]+[Calcoli.AO129]))-0.0004*SIN(RADIANS(2*[Calcoli.AO139]-[Calcoli.AO129]))-0.0006*SIN(RADIANS(2*[Calcoli.AO139]+[Calcoli.AO134]))+0.0021*SIN(RADIANS(2*[Calcoli.AO139]-[Calcoli.AO134]))+0.0003*SIN(RADIANS([Calcoli.AO129]+2*[Calcoli.AO134]))+0.0004*SIN(RADIANS([Calcoli.AO129]-2*[Calcoli.AO134]))-0.0003*SIN(RADIANS(2*[Calcoli.AO129]+[Calcoli.AO134]));4)","v":0.627}]
["Corr_LP",{"$f":"of:=ROUND((0.1734-0.000393*[Calcoli.B121])*SIN(RADIANS([Calcoli.B130]))+0.0021*SIN(RADIANS(2*[Calcoli.B130]))-0.4068*SIN(RADIANS([Calcoli.B135]))+0.0161*SIN(RADIANS(2*[Calcoli.B135]))-0.0004*SIN(RADIANS(3*[Calcoli.B135]))+0.0104*SIN(RADIANS(2*[Calcoli.B140]))-0.0051*SIN(RADIANS([Calcoli.B130]+[Calcoli.B135]))-0.0074*SIN(RADIANS([Calcoli.B130]-[Calcoli.B135]))+0.0004*SIN(RADIANS(2*[Calcoli.B140]+[Calcoli.B130]))-0.0004*SIN(RADIANS(2*[Calcoli.B140]-[Calcoli.B130]))-0.0006*SIN(RADIANS(2*[Calcoli.B140]+[Calcoli.B135]))+0.001*SIN(RADIANS(2*[Calcoli.B140]-[Calcoli.B135]))+0.0005*SIN(RADIANS([Calcoli.B130]+2*[Calcoli.B135]));4)","v":-0.3036},null,"Corr_LP",{"$f":"of:=ROUND((0.1734-0.000393*[Calcoli.E121])*SIN(RADIANS([Calcoli.E130]))+0.0021*SIN(RADIANS(2*[Calcoli.E130]))-0.4068*SIN(RADIANS([Calcoli.E135]))+0.0161*SIN(RADIANS(2*[Calcoli.E135]))-0.0004*SIN(RADIANS(3*[Calcoli.E135]))+0.0104*SIN(RADIANS(2*[Calcoli.E140]))-0.0051*SIN(RADIANS([Calcoli.E130]+[Calcoli.E135]))-0.0074*SIN(RADIANS([Calcoli.E130]-[Calcoli.E135]))+0.0004*SIN(RADIANS(2*[Calcoli.E140]+[Calcoli.E130]))-0.0004*SIN(RADIANS(2*[Calcoli.E140]-[Calcoli.E130]))-0.0006*SIN(RADIANS(2*[Calcoli.E140]+[Calcoli.E135]))+0.001*SIN(RADIANS(2*[Calcoli.E140]-[Calcoli.E135]))+0.0005*SIN(RADIANS([Calcoli.E130]+2*[Calcoli.E135]));4)","v":-0.2934},null,"Corr_LP",{"$f":"of:=ROUND((0.1734-0.000393*[Calcoli.H121])*SIN(RADIANS([Calcoli.H130]))+0.0021*SIN(RADIANS(2*[Calcoli.H130]))-0.4068*SIN(RADIANS([Calcoli.H135]))+0.0161*SIN(RADIANS(2*[Calcoli.H135]))-0.0004*SIN(RADIANS(3*[Calcoli.H135]))+0.0104*SIN(RADIANS(2*[Calcoli.H140]))-0.0051*SIN(RADIANS([Calcoli.H130]+[Calcoli.H135]))-0.0074*SIN(RADIANS([Calcoli.H130]-[Calcoli.H135]))+0.0004*SIN(RADIANS(2*[Calcoli.H140]+[Calcoli.H130]))-0.0004*SIN(RADIANS(2*[Calcoli.H140]-[Calcoli.H130]))-0.0006*SIN(RADIANS(2*[Calcoli.H140]+[Calcoli.H135]))+0.001*SIN(RADIANS(2*[Calcoli.H140]-[Calcoli.H135]))+0.0005*SIN(RADIANS([Calcoli.H130]+2*[Calcoli.H135]));4)","v":-0.2262},null,"Corr_LP",{"$f":"of:=ROUND((0.1734-0.000393*[Calcoli.K121])*SIN(RADIANS([Calcoli.K130]))+0.0021*SIN(RADIANS(2*[Calcoli.K130]))-0.4068*SIN(RADIANS([Calcoli.K135]))+0.0161*SIN(RADIANS(2*[Calcoli.K135]))-0.0004*SIN(RADIANS(3*[Calcoli.K135]))+0.0104*SIN(RADIANS(2*[Calcoli.K140]))-0.0051*SIN(RADIANS([Calcoli.K130]+[Calcoli.K135]))-0.0074*SIN(RADIANS([Calcoli.K130]-[Calcoli.K135]))+0.0004*SIN(RADIANS(2*[Calcoli.K140]+[Calcoli.K130]))-0.0004*SIN(RADIANS(2*[Calcoli.K140]-[Calcoli.K130]))-0.0006*SIN(RADIANS(2*[Calcoli.K140]+[Calcoli.K135]))+0.001*SIN(RADIANS(2*[Calcoli.K140]-[Calcoli.K135]))+0.0005*SIN(RADIANS([Calcoli.K130]+2*[Calcoli.K135]));4)","v":-0.1217},null,"Corr_LP",{"$f":"of:=ROUND((0.1734-0.000393*[Calcoli.N121])*SIN(RADIANS([Calcoli.N130]))+0.0021*SIN(RADIANS(2*[Calcoli.N130]))-0.4068*SIN(RADIANS([Calcoli.N135]))+0.0161*SIN(RADIANS(2*[Calcoli.N135]))-0.0004*SIN(RADIANS(3*[Calcoli.N135]))+0.0104*SIN(RADIANS(2*[Calcoli.N140]))-0.0051*SIN(RADIANS([Calcoli.N130]+[Calcoli.N135]))-0.0074*SIN(RADIANS([Calcoli.N130]-[Calcoli.N135]))+0.0004*SIN(RADIANS(2*[Calcoli.N140]+[Calcoli.N130]))-0.0004*SIN(RADIANS(2*[Calcoli.N140]-[Calcoli.N130]))-0.0006*SIN(RADIANS(2*[Calcoli.N140]+[Calcoli.N135]))+0.001*SIN(RADIANS(2*[Calcoli.N140]-[Calcoli.N135]))+0.0005*SIN(RADIANS([Calcoli.N130]+2*[Calcoli.N135]));4)","v":-0.0032},null,"Corr_LP",{"$f":"of:=ROUND((0.1734-0.000393*[Calcoli.Q121])*SIN(RADIANS([Calcoli.Q130]))+0.0021*SIN(RADIANS(2*[Calcoli.Q130]))-0.4068*SIN(RADIANS([Calcoli.Q135]))+0.0161*SIN(RADIANS(2*[Calcoli.Q135]))-0.0004*SIN(RADIANS(3*[Calcoli.Q135]))+0.0104*SIN(RADIANS(2*[Calcoli.Q140]))-0.0051*SIN(RADIANS([Calcoli.Q130]+[Calcoli.Q135]))-0.0074*SIN(RADIANS([Calcoli.Q130]-[Calcoli.Q135]))+0.0004*SIN(RADIANS(2*[Calcoli.Q140]+[Calcoli.Q130]))-0.0004*SIN(RADIANS(2*[Calcoli.Q140]-[Calcoli.Q130]))-0.0006*SIN(RADIANS(2*[Calcoli.Q140]+[Calcoli.Q135]))+0.001*SIN(RADIANS(2*[Calcoli.Q140]-[Calcoli.Q135]))+0.0005*SIN(RADIANS([Calcoli.Q130]+2*[Calcoli.Q135]));4)","v":0.1101},null,"Corr_LP",{"$f":"of:=ROUND((0.1734-0.000393*[Calcoli.T121])*SIN(RADIANS([Calcoli.T130]))+0.0021*SIN(RADIANS(2*[Calcoli.T130]))-0.4068*SIN(RADIANS([Calcoli.T135]))+0.0161*SIN(RADIANS(2*[Calcoli.T135]))-0.0004*SIN(RADIANS(3*[Calcoli.T135]))+0.0104*SIN(RADIANS(2*[Calcoli.T140]))-0.0051*SIN(RADIANS([Calcoli.T130]+[Calcoli.T135]))-0.0074*SIN(RADIANS([Calcoli.T130]-[Calcoli.T135]))+0.0004*SIN(RADIANS(2*[Calcoli.T140]+[Calcoli.T130]))-0.0004*SIN(RADIANS(2*[Calcoli.T140]-[Calcoli.T130]))-0.0006*SIN(RADIANS(2*[Calcoli.T140]+[Calcoli.T135]))+0.001*SIN(RADIANS(2*[Calcoli.T140]-[Calcoli.T135]))+0.0005*SIN(RADIANS([Calcoli.T130]+2*[Calcoli.T135]));4)","v":0.2026},null,"Corr_LP",{"$f":"of:=ROUND((0.1734-0.000393*[Calcoli.W121])*SIN(RADIANS([Calcoli.W130]))+0.0021*SIN(RADIANS(2*[Calcoli.W130]))-0.4068*SIN(RADIANS([Calcoli.W135]))+0.0161*SIN(RADIANS(2*[Calcoli.W135]))-0.0004*SIN(RADIANS(3*[Calcoli.W135]))+0.0104*SIN(RADIANS(2*[Calcoli.W140]))-0.0051*SIN(RADIANS([Calcoli.W130]+[Calcoli.W135]))-0.0074*SIN(RADIANS([Calcoli.W130]-[Calcoli.W135]))+0.0004*SIN(RADIANS(2*[Calcoli.W140]+[Calcoli.W130]))-0.0004*SIN(RADIANS(2*[Calcoli.W140]-[Calcoli.W130]))-0.0006*SIN(RADIANS(2*[Calcoli.W140]+[Calcoli.W135]))+0.001*SIN(RADIANS(2*[Calcoli.W140]-[Calcoli.W135]))+0.0005*SIN(RADIANS([Calcoli.W130]+2*[Calcoli.W135]));4)","v":0.2584},null,"Corr_LP",{"$f":"of:=ROUND((0.1734-0.000393*[Calcoli.Z121])*SIN(RADIANS([Calcoli.Z130]))+0.0021*SIN(RADIANS(2*[Calcoli.Z130]))-0.4068*SIN(RADIANS([Calcoli.Z135]))+0.0161*SIN(RADIANS(2*[Calcoli.Z135]))-0.0004*SIN(RADIANS(3*[Calcoli.Z135]))+0.0104*SIN(RADIANS(2*[Calcoli.Z140]))-0.0051*SIN(RADIANS([Calcoli.Z130]+[Calcoli.Z135]))-0.0074*SIN(RADIANS([Calcoli.Z130]-[Calcoli.Z135]))+0.0004*SIN(RADIANS(2*[Calcoli.Z140]+[Calcoli.Z130]))-0.0004*SIN(RADIANS(2*[Calcoli.Z140]-[Calcoli.Z130]))-0.0006*SIN(RADIANS(2*[Calcoli.Z140]+[Calcoli.Z135]))+0.001*SIN(RADIANS(2*[Calcoli.Z140]-[Calcoli.Z135]))+0.0005*SIN(RADIANS([Calcoli.Z130]+2*[Calcoli.Z135]));4)","v":0.264},null,"Corr_LP",{"$f":"of:=ROUND((0.1734-0.000393*[Calcoli.AC121])*SIN(RADIANS([Calcoli.AC130]))+0.0021*SIN(RADIANS(2*[Calcoli.AC130]))-0.4068*SIN(RADIANS([Calcoli.AC135]))+0.0161*SIN(RADIANS(2*[Calcoli.AC135]))-0.0004*SIN(RADIANS(3*[Calcoli.AC135]))+0.0104*SIN(RADIANS(2*[Calcoli.AC140]))-0.0051*SIN(RADIANS([Calcoli.AC130]+[Calcoli.AC135]))-0.0074*SIN(RADIANS([Calcoli.AC130]-[Calcoli.AC135]))+0.0004*SIN(RADIANS(2*[Calcoli.AC140]+[Calcoli.AC130]))-0.0004*SIN(RADIANS(2*[Calcoli.AC140]-[Calcoli.AC130]))-0.0006*SIN(RADIANS(2*[Calcoli.AC140]+[Calcoli.AC135]))+0.001*SIN(RADIANS(2*[Calcoli.AC140]-[Calcoli.AC135]))+0.0005*SIN(RADIANS([Calcoli.AC130]+2*[Calcoli.AC135]));4)","v":0.2174},null,"Corr_LP",{"$f":"of:=ROUND((0.1734-0.000393*[Calcoli.AF121])*SIN(RADIANS([Calcoli.AF130]))+0.0021*SIN(RADIANS(2*[Calcoli.AF130]))-0.4068*SIN(RADIANS([Calcoli.AF135]))+0.0161*SIN(RADIANS(2*[Calcoli.AF135]))-0.0004*SIN(RADIANS(3*[Calcoli.AF135]))+0.0104*SIN(RADIANS(2*[Calcoli.AF140]))-0.0051*SIN(RADIANS([Calcoli.AF130]+[Calcoli.AF135]))-0.0074*SIN(RADIANS([Calcoli.AF130]-[Calcoli.AF135]))+0.0004*SIN(RADIANS(2*[Calcoli.AF140]+[Calcoli.AF130]))-0.0004*SIN(RADIANS(2*[Calcoli.AF140]-[Calcoli.AF130]))-0.0006*SIN(RADIANS(2*[Calcoli.AF140]+[Calcoli.AF135]))+0.001*SIN(RADIANS(2*[Calcoli.AF140]-[Calcoli.AF135]))+0.0005*SIN(RADIANS([Calcoli.AF130]+2*[Calcoli.AF135]));4)","v":0.133},null,"Corr_LP",{"$f":"of:=ROUND((0.1734-0.000393*[Calcoli.AI121])*SIN(RADIANS([Calcoli.AI130]))+0.0021*SIN(RADIANS(2*[Calcoli.AI130]))-0.4068*SIN(RADIANS([Calcoli.AI135]))+0.0161*SIN(RADIANS(2*[Calcoli.AI135]))-0.0004*SIN(RADIANS(3*[Calcoli.AI135]))+0.0104*SIN(RADIANS(2*[Calcoli.AI140]))-0.0051*SIN(RADIANS([Calcoli.AI130]+[Calcoli.AI135]))-0.0074*SIN(RADIANS([Calcoli.AI130]-[Calcoli.AI135]))+0.0004*SIN(RADIANS(2*[Calcoli.AI140]+[Calcoli.AI130]))-0.0004*SIN(RADIANS(2*[Calcoli.AI140]-[Calcoli.AI130]))-0.0006*SIN(RADIANS(2*[Calcoli.AI140]+[Calcoli.AI135]))+0.001*SIN(RADIANS(2*[Calcoli.AI140]-[Calcoli.AI135]))+0.0005*SIN(RADIANS([Calcoli.AI130]+2*[Calcoli.AI135]));4)","v":0.0358},null,"Corr_LP",{"$f":"of:=ROUND((0.1734-0.000393*[Calcoli.AL121])*SIN(RADIANS([Calcoli.AL130]))+0.0021*SIN(RADIANS(2*[Calcoli.AL130]))-0.4068*SIN(RADIANS([Calcoli.AL135]))+0.0161*SIN(RADIANS(2*[Calcoli.AL135]))-0.0004*SIN(RADIANS(3*[Calcoli.AL135]))+0.0104*SIN(RADIANS(2*[Calcoli.AL140]))-0.0051*SIN(RADIANS([Calcoli.AL130]+[Calcoli.AL135]))-0.0074*SIN(RADIANS([Calcoli.AL130]-[Calcoli.AL135]))+0.0004*SIN(RADIANS(2*[Calcoli.AL140]+[Calcoli.AL130]))-0.0004*SIN(RADIANS(2*[Calcoli.AL140]-[Calcoli.AL130]))-0.0006*SIN(RADIANS(2*[Calcoli.AL140]+[Calcoli.AL135]))+0.001*SIN(RADIANS(2*[Calcoli.AL140]-[Calcoli.AL135]))+0.0005*SIN(RADIANS([Calcoli.AL130]+2*[Calcoli.AL135]));4)","v":-0.0524},null,"Corr_LP",{"$f":"of:=ROUND((0.1734-0.000393*[Calcoli.AO121])*SIN(RADIANS([Calcoli.AO130]))+0.0021*SIN(RADIANS(2*[Calcoli.AO130]))-0.4068*SIN(RADIANS([Calcoli.AO135]))+0.0161*SIN(RADIANS(2*[Calcoli.AO135]))-0.0004*SIN(RADIANS(3*[Calcoli.AO135]))+0.0104*SIN(RADIANS(2*[Calcoli.AO140]))-0.0051*SIN(RADIANS([Calcoli.AO130]+[Calcoli.AO135]))-0.0074*SIN(RADIANS([Calcoli.AO130]-[Calcoli.AO135]))+0.0004*SIN(RADIANS(2*[Calcoli.AO140]+[Calcoli.AO130]))-0.0004*SIN(RADIANS(2*[Calcoli.AO140]-[Calcoli.AO130]))-0.0006*SIN(RADIANS(2*[Calcoli.AO140]+[Calcoli.AO135]))+0.001*SIN(RADIANS(2*[Calcoli.AO140]-[Calcoli.AO135]))+0.0005*SIN(RADIANS([Calcoli.AO130]+2*[Calcoli.AO135]));4)","v":-0.1231}]
["Corr_UQ",{"$f":"of:=ROUND((0.1721-0.0004*[Calcoli.B122])*SIN(RADIANS([Calcoli.B131]))+0.0021*SIN(RADIANS(2*[Calcoli.B131]))-0.628*SIN(RADIANS([Calcoli.B136]))+0.0089*SIN(RADIANS(2*[Calcoli.B136]))-0.0004*SIN(RADIANS(3*[Calcoli.B136]))+0.0079*SIN(RADIANS(2*[Calcoli.B141]))-0.0119*SIN(RADIANS([Calcoli.B131]+[Calcoli.B136]))-0.0047*SIN(RADIANS([Calcoli.B131]-[Calcoli.B136]))+0.0003*SIN(RADIANS(2*[Calcoli.B141]+[Calcoli.B131]))-0.0004*SIN(RADIANS(2*[Calcoli.B141]-[Calcoli.B131]))-0.0006*SIN(RADIANS(2*[Calcoli.B141]+[Calcoli.B136]))+0.0021*SIN(RADIANS(2*[Calcoli.B141]-[Calcoli.B136]))+0.0003*SIN(RADIANS([Calcoli.B131]+2*[Calcoli.B136]))+0.0004*SIN(RADIANS([Calcoli.B131]-2*[Calcoli.B136]))-0.0003*SIN(RADIANS(2*[Calcoli.B131]+[Calcoli.B136]));4)","v":-0.2403},null,"Corr_UQ",{"$f":"of:=ROUND((0.1721-0.0004*[Calcoli.E122])*SIN(RADIANS([Calcoli.E131]))+0.0021*SIN(RADIANS(2*[Calcoli.E131]))-0.628*SIN(RADIANS([Calcoli.E136]))+0.0089*SIN(RADIANS(2*[Calcoli.E136]))-0.0004*SIN(RADIANS(3*[Calcoli.E136]))+0.0079*SIN(RADIANS(2*[Calcoli.E141]))-0.0119*SIN(RADIANS([Calcoli.E131]+[Calcoli.E136]))-0.0047*SIN(RADIANS([Calcoli.E131]-[Calcoli.E136]))+0.0003*SIN(RADIANS(2*[Calcoli.E141]+[Calcoli.E131]))-0.0004*SIN(RADIANS(2*[Calcoli.E141]-[Calcoli.E131]))-0.0006*SIN(RADIANS(2*[Calcoli.E141]+[Calcoli.E136]))+0.0021*SIN(RADIANS(2*[Calcoli.E141]-[Calcoli.E136]))+0.0003*SIN(RADIANS([Calcoli.E131]+2*[Calcoli.E136]))+0.0004*SIN(RADIANS([Calcoli.E131]-2*[Calcoli.E136]))-0.0003*SIN(RADIANS(2*[Calcoli.E131]+[Calcoli.E136]));4)","v":0.1187},null,"Corr_UQ",{"$f":"of:=ROUND((0.1721-0.0004*[Calcoli.H122])*SIN(RADIANS([Calcoli.H131]))+0.0021*SIN(RADIANS(2*[Calcoli.H131]))-0.628*SIN(RADIANS([Calcoli.H136]))+0.0089*SIN(RADIANS(2*[Calcoli.H136]))-0.0004*SIN(RADIANS(3*[Calcoli.H136]))+0.0079*SIN(RADIANS(2*[Calcoli.H141]))-0.0119*SIN(RADIANS([Calcoli.H131]+[Calcoli.H136]))-0.0047*SIN(RADIANS([Calcoli.H131]-[Calcoli.H136]))+0.0003*SIN(RADIANS(2*[Calcoli.H141]+[Calcoli.H131]))-0.0004*SIN(RADIANS(2*[Calcoli.H141]-[Calcoli.H131]))-0.0006*SIN(RADIANS(2*[Calcoli.H141]+[Calcoli.H136]))+0.0021*SIN(RADIANS(2*[Calcoli.H141]-[Calcoli.H136]))+0.0003*SIN(RADIANS([Calcoli.H131]+2*[Calcoli.H136]))+0.0004*SIN(RADIANS([Calcoli.H131]-2*[Calcoli.H136]))-0.0003*SIN(RADIANS(2*[Calcoli.H131]+[Calcoli.H136]));4)","v":0.4399},null,"Corr_UQ",{"$f":"of:=ROUND((0.1721-0.0004*[Calcoli.K122])*SIN(RADIANS([Calcoli.K131]))+0.0021*SIN(RADIANS(2*[Calcoli.K131]))-0.628*SIN(RADIANS([Calcoli.K136]))+0.0089*SIN(RADIANS(2*[Calcoli.K136]))-0.0004*SIN(RADIANS(3*[Calcoli.K136]))+0.0079*SIN(RADIANS(2*[Calcoli.K141]))-0.0119*SIN(RADIANS([Calcoli.K131]+[Calcoli.K136]))-0.0047*SIN(RADIANS([Calcoli.K131]-[Calcoli.K136]))+0.0003*SIN(RADIANS(2*[Calcoli.K141]+[Calcoli.K131]))-0.0004*SIN(RADIANS(2*[Calcoli.K141]-[Calcoli.K131]))-0.0006*SIN(RADIANS(2*[Calcoli.K141]+[Calcoli.K136]))+0.0021*SIN(RADIANS(2*[Calcoli.K141]-[Calcoli.K136]))+0.0003*SIN(RADIANS([Calcoli.K131]+2*[Calcoli.K136]))+0.0004*SIN(RADIANS([Calcoli.K131]-2*[Calcoli.K136]))-0.0003*SIN(RADIANS(2*[Calcoli.K131]+[Calcoli.K136]));4)","v":0.6586},null,"Corr_UQ",{"$f":"of:=ROUND((0.1721-0.0004*[Calcoli.N122])*SIN(RADIANS([Calcoli.N131]))+0.0021*SIN(RADIANS(2*[Calcoli.N131]))-0.628*SIN(RADIANS([Calcoli.N136]))+0.0089*SIN(RADIANS(2*[Calcoli.N136]))-0.0004*SIN(RADIANS(3*[Calcoli.N136]))+0.0079*SIN(RADIANS(2*[Calcoli.N141]))-0.0119*SIN(RADIANS([Calcoli.N131]+[Calcoli.N136]))-0.0047*SIN(RADIANS([Calcoli.N131]-[Calcoli.N136]))+0.0003*SIN(RADIANS(2*[Calcoli.N141]+[Calcoli.N131]))-0.0004*SIN(RADIANS(2*[Calcoli.N141]-[Calcoli.N131]))-0.0006*SIN(RADIANS(2*[Calcoli.N141]+[Calcoli.N136]))+0.0021*SIN(RADIANS(2*[Calcoli.N141]-[Calcoli.N136]))+0.0003*SIN(RADIANS([Calcoli.N131]+2*[Calcoli.N136]))+0.0004*SIN(RADIANS([Calcoli.N131]-2*[Calcoli.N136]))-0.0003*SIN(RADIANS(2*[Calcoli.N131]+[Calcoli.N136]));4)","v":0.7363},null,"Corr_UQ",{"$f":"of:=ROUND((0.1721-0.0004*[Calcoli.Q122])*SIN(RADIANS([Calcoli.Q131]))+0.0021*SIN(RADIANS(2*[Calcoli.Q131]))-0.628*SIN(RADIANS([Calcoli.Q136]))+0.0089*SIN(RADIANS(2*[Calcoli.Q136]))-0.0004*SIN(RADIANS(3*[Calcoli.Q136]))+0.0079*SIN(RADIANS(2*[Calcoli.Q141]))-0.0119*SIN(RADIANS([Calcoli.Q131]+[Calcoli.Q136]))-0.0047*SIN(RADIANS([Calcoli.Q131]-[Calcoli.Q136]))+0.0003*SIN(RADIANS(2*[Calcoli.Q141]+[Calcoli.Q131]))-0.0004*SIN(RADIANS(2*[Calcoli.Q141]-[Calcoli.Q131]))-0.0006*SIN(RADIANS(2*[Calcoli.Q141]+[Calcoli.Q136]))+0.0021*SIN(RADIANS(2*[Calcoli.Q141]-[Calcoli.Q136]))+0.0003*SIN(RADIANS([Calcoli.Q131]+2*[Calcoli.Q136]))+0.0004*SIN(RADIANS([Calcoli.Q131]-2*[Calcoli.Q136]))-0.0003*SIN(RADIANS(2*[Calcoli.Q131]+[Calcoli.Q136]));4)","v":0.6639},null,"Corr_UQ",{"$f":"of:=ROUND((0.1721-0.0004*[Calcoli.T122])*SIN(RADIANS([Calcoli.T131]))+0.0021*SIN(RADIANS(2*[Calcoli.T131]))-0.628*SIN(RADIANS([Calcoli.T136]))+0.0089*SIN(RADIANS(2*[Calcoli.T136]))-0.0004*SIN(RADIANS(3*[Calcoli.T136]))+0.0079*SIN(RADIANS(2*[Calcoli.T141]))-0.0119*SIN(RADIANS([Calcoli.T131]+[Calcoli.T136]))-0.0047*SIN(RADIANS([Calcoli.T131]-[Calcoli.T136]))+0.0003*SIN(RADIANS(2*[Calcoli.T141]+[Calcoli.T131]))-0.0004*SIN(RADIANS(2*[Calcoli.T141]-[Calcoli.T131]))-0.0006*SIN(RADIANS(2*[Calcoli.T141]+[Calcoli.T136]))+0.0021*SIN(RADIANS(2*[Calcoli.T141]-[Calcoli.T136]))+0.0003*SIN(RADIANS([Calcoli.T131]+2*[Calcoli.T136]))+0.0004*SIN(RADIANS([Calcoli.T131]-2*[Calcoli.T136]))-0.0003*SIN(RADIANS(2*[Calcoli.T131]+[Calcoli.T136]));4)","v":0.4616},null,"Corr_UQ",{"$f":"of:=ROUND((0.1721-0.0004*[Calcoli.W122])*SIN(RADIANS([Calcoli.W131]))+0.0021*SIN(RADIANS(2*[Calcoli.W131]))-0.628*SIN(RADIANS([Calcoli.W136]))+0.0089*SIN(RADIANS(2*[Calcoli.W136]))-0.0004*SIN(RADIANS(3*[Calcoli.W136]))+0.0079*SIN(RADIANS(2*[Calcoli.W141]))-0.0119*SIN(RADIANS([Calcoli.W131]+[Calcoli.W136]))-0.0047*SIN(RADIANS([Calcoli.W131]-[Calcoli.W136]))+0.0003*SIN(RADIANS(2*[Calcoli.W141]+[Calcoli.W131]))-0.0004*SIN(RADIANS(2*[Calcoli.W141]-[Calcoli.W131]))-0.0006*SIN(RADIANS(2*[Calcoli.W141]+[Calcoli.W136]))+0.0021*SIN(RADIANS(2*[Calcoli.W141]-[Calcoli.W136]))+0.0003*SIN(RADIANS([Calcoli.W131]+2*[Calcoli.W136]))+0.0004*SIN(RADIANS([Calcoli.W131]-2*[Calcoli.W136]))-0.0003*SIN(RADIANS(2*[Calcoli.W131]+[Calcoli.W136]));4)","v":0.1736},null,"Corr_UQ",{"$f":"of:=ROUND((0.1721-0.0004*[Calcoli.Z122])*SIN(RADIANS([Calcoli.Z131]))+0.0021*SIN(RADIANS(2*[Calcoli.Z131]))-0.628*SIN(RADIANS([Calcoli.Z136]))+0.0089*SIN(RADIANS(2*[Calcoli.Z136]))-0.0004*SIN(RADIANS(3*[Calcoli.Z136]))+0.0079*SIN(RADIANS(2*[Calcoli.Z141]))-0.0119*SIN(RADIANS([Calcoli.Z131]+[Calcoli.Z136]))-0.0047*SIN(RADIANS([Calcoli.Z131]-[Calcoli.Z136]))+0.0003*SIN(RADIANS(2*[Calcoli.Z141]+[Calcoli.Z131]))-0.0004*SIN(RADIANS(2*[Calcoli.Z141]-[Calcoli.Z131]))-0.0006*SIN(RADIANS(2*[Calcoli.Z141]+[Calcoli.Z136]))+0.0021*SIN(RADIANS(2*[Calcoli.Z141]-[Calcoli.Z136]))+0.0003*SIN(RADIANS([Calcoli.Z131]+2*[Calcoli.Z136]))+0.0004*SIN(RADIANS([Calcoli.Z131]-2*[Calcoli.Z136]))-0.0003*SIN(RADIANS(2*[Calcoli.Z131]+[Calcoli.Z136]));4)","v":-0.142},null,"Corr_UQ",{"$f":"of:=ROUND((0.1721-0.0004*[Calcoli.AC122])*SIN(RADIANS([Calcoli.AC131]))+0.0021*SIN(RADIANS(2*[Calcoli.AC131]))-0.628*SIN(RADIANS([Calcoli.AC136]))+0.0089*SIN(RADIANS(2*[Calcoli.AC136]))-0.0004*SIN(RADIANS(3*[Calcoli.AC136]))+0.0079*SIN(RADIANS(2*[Calcoli.AC141]))-0.0119*SIN(RADIANS([Calcoli.AC131]+[Calcoli.AC136]))-0.0047*SIN(RADIANS([Calcoli.AC131]-[Calcoli.AC136]))+0.0003*SIN(RADIANS(2*[Calcoli.AC141]+[Calcoli.AC131]))-0.0004*SIN(RADIANS(2*[Calcoli.AC141]-[Calcoli.AC131]))-0.0006*SIN(RADIANS(2*[Calcoli.AC141]+[Calcoli.AC136]))+0.0021*SIN(RADIANS(2*[Calcoli.AC141]-[Calcoli.AC136]))+0.0003*SIN(RADIANS([Calcoli.AC131]+2*[Calcoli.AC136]))+0.0004*SIN(RADIANS([Calcoli.AC131]-2*[Calcoli.AC136]))-0.0003*SIN(RADIANS(2*[Calcoli.AC131]+[Calcoli.AC136]));4)","v":-0.4224},null,"Corr_UQ",{"$f":"of:=ROUND((0.1721-0.0004*[Calcoli.AF122])*SIN(RADIANS([Calcoli.AF131]))+0.0021*SIN(RADIANS(2*[Calcoli.AF131]))-0.628*SIN(RADIANS([Calcoli.AF136]))+0.0089*SIN(RADIANS(2*[Calcoli.AF136]))-0.0004*SIN(RADIANS(3*[Calcoli.AF136]))+0.0079*SIN(RADIANS(2*[Calcoli.AF141]))-0.0119*SIN(RADIANS([Calcoli.AF131]+[Calcoli.AF136]))-0.0047*SIN(RADIANS([Calcoli.AF131]-[Calcoli.AF136]))+0.0003*SIN(RADIANS(2*[Calcoli.AF141]+[Calcoli.AF131]))-0.0004*SIN(RADIANS(2*[Calcoli.AF141]-[Calcoli.AF131]))-0.0006*SIN(RADIANS(2*[Calcoli.AF141]+[Calcoli.AF136]))+0.0021*SIN(RADIANS(2*[Calcoli.AF141]-[Calcoli.AF136]))+0.0003*SIN(RADIANS([Calcoli.AF131]+2*[Calcoli.AF136]))+0.0004*SIN(RADIANS([Calcoli.AF131]-2*[Calcoli.AF136]))-0.0003*SIN(RADIANS(2*[Calcoli.AF131]+[Calcoli.AF136]));4)","v":-0.6122},null,"Corr_UQ",{"$f":"of:=ROUND((0.1721-0.0004*[Calcoli.AI122])*SIN(RADIANS([Calcoli.AI131]))+0.0021*SIN(RADIANS(2*[Calcoli.AI131]))-0.628*SIN(RADIANS([Calcoli.AI136]))+0.0089*SIN(RADIANS(2*[Calcoli.AI136]))-0.0004*SIN(RADIANS(3*[Calcoli.AI136]))+0.0079*SIN(RADIANS(2*[Calcoli.AI141]))-0.0119*SIN(RADIANS([Calcoli.AI131]+[Calcoli.AI136]))-0.0047*SIN(RADIANS([Calcoli.AI131]-[Calcoli.AI136]))+0.0003*SIN(RADIANS(2*[Calcoli.AI141]+[Calcoli.AI131]))-0.0004*SIN(RADIANS(2*[Calcoli.AI141]-[Calcoli.AI131]))-0.0006*SIN(RADIANS(2*[Calcoli.AI141]+[Calcoli.AI136]))+0.0021*SIN(RADIANS(2*[Calcoli.AI141]-[Calcoli.AI136]))+0.0003*SIN(RADIANS([Calcoli.AI131]+2*[Calcoli.AI136]))+0.0004*SIN(RADIANS([Calcoli.AI131]-2*[Calcoli.AI136]))-0.0003*SIN(RADIANS(2*[Calcoli.AI131]+[Calcoli.AI136]));4)","v":-0.6745},null,"Corr_UQ",{"$f":"of:=ROUND((0.1721-0.0004*[Calcoli.AL122])*SIN(RADIANS([Calcoli.AL131]))+0.0021*SIN(RADIANS(2*[Calcoli.AL131]))-0.628*SIN(RADIANS([Calcoli.AL136]))+0.0089*SIN(RADIANS(2*[Calcoli.AL136]))-0.0004*SIN(RADIANS(3*[Calcoli.AL136]))+0.0079*SIN(RADIANS(2*[Calcoli.AL141]))-0.0119*SIN(RADIANS([Calcoli.AL131]+[Calcoli.AL136]))-0.0047*SIN(RADIANS([Calcoli.AL131]-[Calcoli.AL136]))+0.0003*SIN(RADIANS(2*[Calcoli.AL141]+[Calcoli.AL131]))-0.0004*SIN(RADIANS(2*[Calcoli.AL141]-[Calcoli.AL131]))-0.0006*SIN(RADIANS(2*[Calcoli.AL141]+[Calcoli.AL136]))+0.0021*SIN(RADIANS(2*[Calcoli.AL141]-[Calcoli.AL136]))+0.0003*SIN(RADIANS([Calcoli.AL131]+2*[Calcoli.AL136]))+0.0004*SIN(RADIANS([Calcoli.AL131]-2*[Calcoli.AL136]))-0.0003*SIN(RADIANS(2*[Calcoli.AL131]+[Calcoli.AL136]));4)","v":-0.5987},null,"Corr_UQ",{"$f":"of:=ROUND((0.1721-0.0004*[Calcoli.AO122])*SIN(RADIANS([Calcoli.AO131]))+0.0021*SIN(RADIANS(2*[Calcoli.AO131]))-0.628*SIN(RADIANS([Calcoli.AO136]))+0.0089*SIN(RADIANS(2*[Calcoli.AO136]))-0.0004*SIN(RADIANS(3*[Calcoli.AO136]))+0.0079*SIN(RADIANS(2*[Calcoli.AO141]))-0.0119*SIN(RADIANS([Calcoli.AO131]+[Calcoli.AO136]))-0.0047*SIN(RADIANS([Calcoli.AO131]-[Calcoli.AO136]))+0.0003*SIN(RADIANS(2*[Calcoli.AO141]+[Calcoli.AO131]))-0.0004*SIN(RADIANS(2*[Calcoli.AO141]-[Calcoli.AO131]))-0.0006*SIN(RADIANS(2*[Calcoli.AO141]+[Calcoli.AO136]))+0.0021*SIN(RADIANS(2*[Calcoli.AO141]-[Calcoli.AO136]))+0.0003*SIN(RADIANS([Calcoli.AO131]+2*[Calcoli.AO136]))+0.0004*SIN(RADIANS([Calcoli.AO131]-2*[Calcoli.AO136]))-0.0003*SIN(RADIANS(2*[Calcoli.AO131]+[Calcoli.AO136]));4)","v":-0.4007},null,"MIN("]
["LN",{"$f":"of:=ROUND([Calcoli.B123]+[Calcoli.B142];4)","v":2457751.7877},null,"LN",{"$f":"of:=ROUND([Calcoli.E123]+[Calcoli.E142];4)","v":2457781.5059},null,"LN",{"$f":"of:=ROUND([Calcoli.H123]+[Calcoli.H142];4)","v":2457811.1253},null,"LN",{"$f":"of:=ROUND([Calcoli.K123]+[Calcoli.K142];4)","v":2457840.6247},null,"LN",{"$f":"of:=ROUND([Calcoli.N123]+[Calcoli.N142];4)","v":2457870.0128},null,"LN",{"$f":"of:=ROUND([Calcoli.Q123]+[Calcoli.Q142];4)","v":2457899.324},null,"LN",{"$f":"of:=ROUND([Calcoli.T123]+[Calcoli.T142];4)","v":2457928.6063},null,"LN",{"$f":"of:=ROUND([Calcoli.W123]+[Calcoli.W142];4)","v":2457957.9082},null,"LN",{"$f":"of:=ROUND([Calcoli.Z123]+[Calcoli.Z142];4)","v":2457987.2722},null,"LN",{"$f":"of:=ROUND([Calcoli.AC123]+[Calcoli.AC142];4)","v":2458016.73},null,"LN",{"$f":"of:=ROUND([Calcoli.AF123]+[Calcoli.AF142];4)","v":2458046.3008},null,"LN",{"$f":"of:=ROUND([Calcoli.AI123]+[Calcoli.AI142];4)","v":2458075.9885},null,"LN",{"$f":"of:=ROUND([Calcoli.AL123]+[Calcoli.AL142];4)","v":2458105.7723},null,"LN",{"$f":"of:=ROUND([Calcoli.AO123]+[Calcoli.AO142];4)","v":2458135.5965}]
["PQ",{"$f":"of:=ROUND([Calcoli.B124]+[Calcoli.B143];4)","v":2457759.3222},null,"PQ",{"$f":"of:=ROUND([Calcoli.E124]+[Calcoli.E143];4)","v":2457788.6777},null,"PQ",{"$f":"of:=ROUND([Calcoli.H124]+[Calcoli.H143];4)","v":2457817.9789},null,"PQ",{"$f":"of:=ROUND([Calcoli.K124]+[Calcoli.K143];4)","v":2457847.2756},null,"PQ",{"$f":"of:=ROUND([Calcoli.N124]+[Calcoli.N143];4)","v":2457876.6139},null,"PQ",{"$f":"of:=ROUND([Calcoli.Q124]+[Calcoli.Q143];4)","v":2457906.0269},null,"PQ",{"$f":"of:=ROUND([Calcoli.T124]+[Calcoli.T143];4)","v":2457935.5331},null,"PQ",{"$f":"of:=ROUND([Calcoli.W124]+[Calcoli.W143];4)","v":2457965.1389},null,"PQ",{"$f":"of:=ROUND([Calcoli.Z124]+[Calcoli.Z143];4)","v":2457994.8409},null,"PQ",{"$f":"of:=ROUND([Calcoli.AC124]+[Calcoli.AC143];4)","v":2458024.6194},null,"PQ",{"$f":"of:=ROUND([Calcoli.AF124]+[Calcoli.AF143];4)","v":2458054.4308},null,"PQ",{"$f":"of:=ROUND([Calcoli.AI124]+[Calcoli.AI143];4)","v":2458084.2088},null,"PQ",{"$f":"of:=ROUND([Calcoli.AL124]+[Calcoli.AL143];4)","v":2458113.8871},null,"PQ",{"$f":"of:=ROUND([Calcoli.AO124]+[Calcoli.AO143];4)","v":2458143.4289}]
["LP",{"$f":"of:=ROUND([Calcoli.B125]+[Calcoli.B144];4)","v":2457765.9828},null,"LP",{"$f":"of:=ROUND([Calcoli.E125]+[Calcoli.E144];4)","v":2457795.5237},null,"LP",{"$f":"of:=ROUND([Calcoli.H125]+[Calcoli.H144];4)","v":2457825.1215},null,"LP",{"$f":"of:=ROUND([Calcoli.K125]+[Calcoli.K144];4)","v":2457854.7566},null,"LP",{"$f":"of:=ROUND([Calcoli.N125]+[Calcoli.N144];4)","v":2457884.4057},null,"LP",{"$f":"of:=ROUND([Calcoli.Q125]+[Calcoli.Q144];4)","v":2457914.0497},null,"LP",{"$f":"of:=ROUND([Calcoli.T125]+[Calcoli.T144];4)","v":2457943.6728},null,"LP",{"$f":"of:=ROUND([Calcoli.W125]+[Calcoli.W144];4)","v":2457973.2592},null,"LP",{"$f":"of:=ROUND([Calcoli.Z125]+[Calcoli.Z144];4)","v":2458002.7954},null,"LP",{"$f":"of:=ROUND([Calcoli.AC125]+[Calcoli.AC144];4)","v":2458032.2794},null,"LP",{"$f":"of:=ROUND([Calcoli.AF125]+[Calcoli.AF144];4)","v":2458061.7257},null,"LP",{"$f":"of:=ROUND([Calcoli.AI125]+[Calcoli.AI144];4)","v":2458091.1591},null,"LP",{"$f":"of:=ROUND([Calcoli.AL125]+[Calcoli.AL144];4)","v":2458120.6015},null,"LP",{"$f":"of:=ROUND([Calcoli.AO125]+[Calcoli.AO144];4)","v":2458150.0614}]
["UQ",{"$f":"of:=ROUND([Calcoli.B126]+[Calcoli.B145];4)","v":2457773.4288},null,"UQ",{"$f":"of:=ROUND([Calcoli.E126]+[Calcoli.E145];4)","v":2457803.3184},null,"UQ",{"$f":"of:=ROUND([Calcoli.H126]+[Calcoli.H145];4)","v":2457833.1702},null,"UQ",{"$f":"of:=ROUND([Calcoli.K126]+[Calcoli.K145];4)","v":2457862.9196},null,"UQ",{"$f":"of:=ROUND([Calcoli.N126]+[Calcoli.N145];4)","v":2457892.5279},null,"UQ",{"$f":"of:=ROUND([Calcoli.Q126]+[Calcoli.Q145];4)","v":2457921.9861},null,"UQ",{"$f":"of:=ROUND([Calcoli.T126]+[Calcoli.T145];4)","v":2457951.3144},null,"UQ",{"$f":"of:=ROUND([Calcoli.W126]+[Calcoli.W145];4)","v":2457980.5571},null,"UQ",{"$f":"of:=ROUND([Calcoli.Z126]+[Calcoli.Z145];4)","v":2458009.7721},null,"UQ",{"$f":"of:=ROUND([Calcoli.AC126]+[Calcoli.AC145];4)","v":2458039.0223},null,"UQ",{"$f":"of:=ROUND([Calcoli.AF126]+[Calcoli.AF145];4)","v":2458068.3631},null,"UQ",{"$f":"of:=ROUND([Calcoli.AI126]+[Calcoli.AI145];4)","v":2458097.8314},null,"UQ",{"$f":"of:=ROUND([Calcoli.AL126]+[Calcoli.AL145];4)","v":2458127.4378},null,"UQ",{"$f":"of:=ROUND([Calcoli.AO126]+[Calcoli.AO145];4)","v":2458157.1665}]
["GD_DATA",{"$f":"of:=\"2003,110100\"","v":"2003,110100"},null,"GD_DATA",{"$f":"of:=\"2003,110100\"","v":"2003,110100"},null,"GD_DATA",{"$f":"of:=\"2003,110100\"","v":"2003,110100"},null,"GD_DATA",{"$f":"of:=\"2003,110100\"","v":"2003,110100"},null,"GD_DATA",{"$f":"of:=\"2003,110100\"","v":"2003,110100"},null,"GD_DATA",{"$f":"of:=\"2003,110100\"","v":"2003,110100"},null,"GD_DATA",{"$f":"of:=\"2003,110100\"","v":"2003,110100"},null,"GD_DATA",{"$f":"of:=\"2003,110100\"","v":"2003,110100"},null,"GD_DATA",{"$f":"of:=\"2003,110100\"","v":"2003,110100"},null,"GD_DATA",{"$f":"of:=\"2003,110100\"","v":"2003,110100"},null,"GD_DATA",{"$f":"of:=\"2003,110100\"","v":"2003,110100"},null,"GD_DATA",{"$f":"of:=\"2003,110100\"","v":"2003,110100"},null,"GD_DATA",{"$f":"of:=\"2003,110100\"","v":"2003,110100"},null,"GD_DATA",{"$f":"of:=\"2003,110100\"","v":"2003,110100"}]
["YYYY",{"$f":"of:=IF(LEFT(RIGHT([Calcoli.B150];6);2)>2;INT([Calcoli.B150]);INT([Calcoli.B150])-1)","v":2003},null,"YYYY",{"$f":"of:=IF(LEFT(RIGHT([Calcoli.E150];6);2)>2;INT([Calcoli.E150]);INT([Calcoli.E150])-1)","v":2003},null,"YYYY",{"$f":"of:=IF(LEFT(RIGHT([Calcoli.H150];6);2)>2;INT([Calcoli.H150]);INT([Calcoli.H150])-1)","v":2003},null,"YYYY",{"$f":"of:=IF(LEFT(RIGHT([Calcoli.K150];6);2)>2;INT([Calcoli.K150]);INT([Calcoli.K150])-1)","v":2003},null,"YYYY",{"$f":"of:=IF(LEFT(RIGHT([Calcoli.N150];6);2)>2;INT([Calcoli.N150]);INT([Calcoli.N150])-1)","v":2003},null,"YYYY",{"$f":"of:=IF(LEFT(RIGHT([Calcoli.Q150];6);2)>2;INT([Calcoli.Q150]);INT([Calcoli.Q150])-1)","v":2003},null,"YYYY",{"$f":"of:=IF(LEFT(RIGHT([Calcoli.T150];6);2)>2;INT([Calcoli.T150]);INT([Calcoli.T150])-1)","v":2003},null,"YYYY",{"$f":"of:=IF(LEFT(RIGHT([Calcoli.W150];6);2)>2;INT([Calcoli.W150]);INT([Calcoli.W150])-1)","v":2003},null,"YYYY",{"$f":"of:=IF(LEFT(RIGHT([Calcoli.Z150];6);2)>2;INT([Calcoli.Z150]);INT([Calcoli.Z150])-1)","v":2003},null,"YYYY",{"$f":"of:=IF(LEFT(RIGHT([Calcoli.AC150];6);2)>2;INT([Calcoli.AC150]);INT([Calcoli.AC150])-1)","v":2003},null,"YYYY",{"$f":"of:=IF(LEFT(RIGHT([Calcoli.AF150];6);2)>2;INT([Calcoli.AF150]);INT([Calcoli.AF150])-1)","v":2003},null,"YYYY",{"$f":"of:=IF(LEFT(RIGHT([Calcoli.AI150];6);2)>2;INT([Calcoli.AI150]);INT([Calcoli.AI150])-1)","v":2003},null,"YYYY",{"$f":"of:=IF(LEFT(RIGHT([Calcoli.AL150];6);2)>2;INT([Calcoli.AL150]);INT([Calcoli.AL150])-1)","v":2003},null,"YYYY",{"$f":"of:=IF(LEFT(RIGHT([Calcoli.AO150];6);2)>2;INT([Calcoli.AO150]);INT([Calcoli.AO150])-1)","v":2003}]
["MM",{"$f":"of:=IF(LEFT(RIGHT([Calcoli.B150];6);2)>2;LEFT(RIGHT([Calcoli.B150];6);2);LEFT(RIGHT([Calcoli.B150];6);2)+12)","v":"11"},null,"MM",{"$f":"of:=IF(LEFT(RIGHT([Calcoli.E150];6);2)>2;LEFT(RIGHT([Calcoli.E150];6);2);LEFT(RIGHT([Calcoli.E150];6);2)+12)","v":"11"},null,"MM",{"$f":"of:=IF(LEFT(RIGHT([Calcoli.H150];6);2)>2;LEFT(RIGHT([Calcoli.H150];6);2);LEFT(RIGHT([Calcoli.H150];6);2)+12)","v":"11"},null,"MM",{"$f":"of:=IF(LEFT(RIGHT([Calcoli.K150];6);2)>2;LEFT(RIGHT([Calcoli.K150];6);2);LEFT(RIGHT([Calcoli.K150];6);2)+12)","v":"11"},null,"MM",{"$f":"of:=IF(LEFT(RIGHT([Calcoli.N150];6);2)>2;LEFT(RIGHT([Calcoli.N150];6);2);LEFT(RIGHT([Calcoli.N150];6);2)+12)","v":"11"},null,"MM",{"$f":"of:=IF(LEFT(RIGHT([Calcoli.Q150];6);2)>2;LEFT(RIGHT([Calcoli.Q150];6);2);LEFT(RIGHT([Calcoli.Q150];6);2)+12)","v":"11"},null,"MM",{"$f":"of:=IF(LEFT(RIGHT([Calcoli.T150];6);2)>2;LEFT(RIGHT([Calcoli.T150];6);2);LEFT(RIGHT([Calcoli.T150];6);2)+12)","v":"11"},null,"MM",{"$f":"of:=IF(LEFT(RIGHT([Calcoli.W150];6);2)>2;LEFT(RIGHT([Calcoli.W150];6);2);LEFT(RIGHT([Calcoli.W150];6);2)+12)","v":"11"},null,"MM",{"$f":"of:=IF(LEFT(RIGHT([Calcoli.Z150];6);2)>2;LEFT(RIGHT([Calcoli.Z150];6);2);LEFT(RIGHT([Calcoli.Z150];6);2)+12)","v":"11"},null,"MM",{"$f":"of:=IF(LEFT(RIGHT([Calcoli.AC150];6);2)>2;LEFT(RIGHT([Calcoli.AC150];6);2);LEFT(RIGHT([Calcoli.AC150];6);2)+12)","v":"11"},null,"MM",{"$f":"of:=IF(LEFT(RIGHT([Calcoli.AF150];6);2)>2;LEFT(RIGHT([Calcoli.AF150];6);2);LEFT(RIGHT([Calcoli.AF150];6);2)+12)","v":"11"},null,"MM",{"$f":"of:=IF(LEFT(RIGHT([Calcoli.AI150];6);2)>2;LEFT(RIGHT([Calcoli.AI150];6);2);LEFT(RIGHT([Calcoli.AI150];6);2)+12)","v":"11"},null,"MM",{"$f":"of:=IF(LEFT(RIGHT([Calcoli.AL150];6);2)>2;LEFT(RIGHT([Calcoli.AL150];6);2);LEFT(RIGHT([Calcoli.AL150];6);2)+12)","v":"11"},null,"MM",{"$f":"of:=IF(LEFT(RIGHT([Calcoli.AO150];6);2)>2;LEFT(RIGHT([Calcoli.AO150];6);2);LEFT(RIGHT([Calcoli.AO150];6);2)+12)","v":"11"}]
["DD_dd",{"$f":"of:=LEFT(RIGHT([Calcoli.B150];4);2)+(RIGHT([Calcoli.B150];2)/100)","v":1},null,"DD_dd",{"$f":"of:=LEFT(RIGHT([Calcoli.E150];4);2)+(RIGHT([Calcoli.E150];2)/100)","v":1},null,"DD_dd",{"$f":"of:=LEFT(RIGHT([Calcoli.H150];4);2)+(RIGHT([Calcoli.H150];2)/100)","v":1},null,"DD_dd",{"$f":"of:=LEFT(RIGHT([Calcoli.K150];4);2)+(RIGHT([Calcoli.K150];2)/100)","v":1},null,"DD_dd",{"$f":"of:=LEFT(RIGHT([Calcoli.N150];4);2)+(RIGHT([Calcoli.N150];2)/100)","v":1},null,"DD_dd",{"$f":"of:=LEFT(RIGHT([Calcoli.Q150];4);2)+(RIGHT([Calcoli.Q150];2)/100)","v":1},null,"DD_dd",{"$f":"of:=LEFT(RIGHT([Calcoli.T150];4);2)+(RIGHT([Calcoli.T150];2)/100)","v":1},null,"DD_dd",{"$f":"of:=LEFT(RIGHT([Calcoli.W150];4);2)+(RIGHT([Calcoli.W150];2)/100)","v":1},null,"DD_dd",{"$f":"of:=LEFT(RIGHT([Calcoli.Z150];4);2)+(RIGHT([Calcoli.Z150];2)/100)","v":1},null,"DD_dd",{"$f":"of:=LEFT(RIGHT([Calcoli.AC150];4);2)+(RIGHT([Calcoli.AC150];2)/100)","v":1},null,"DD_dd",{"$f":"of:=LEFT(RIGHT([Calcoli.AF150];4);2)+(RIGHT([Calcoli.AF150];2)/100)","v":1},null,"DD_dd",{"$f":"of:=LEFT(RIGHT([Calcoli.AI150];4);2)+(RIGHT([Calcoli.AI150];2)/100)","v":1},null,"DD_dd",{"$f":"of:=LEFT(RIGHT([Calcoli.AL150];4);2)+(RIGHT([Calcoli.AL150];2)/100)","v":1},null,"DD_dd",{"$f":"of:=LEFT(RIGHT([Calcoli.AO150];4);2)+(RIGHT([Calcoli.AO150];2)/100)","v":1}]
["A",{"$f":"of:=IF([Calcoli.B150]<1582.1015;0;INT([Calcoli.B151]/100))","v":20},null,"A",{"$f":"of:=IF([Calcoli.E150]<1582.1015;0;INT([Calcoli.E151]/100))","v":20},null,"A",{"$f":"of:=IF([Calcoli.H150]<1582.1015;0;INT([Calcoli.H151]/100))","v":20},null,"A",{"$f":"of:=IF([Calcoli.K150]<1582.1015;0;INT([Calcoli.K151]/100))","v":20},null,"A",{"$f":"of:=IF([Calcoli.N150]<1582.1015;0;INT([Calcoli.N151]/100))","v":20},null,"A",{"$f":"of:=IF([Calcoli.Q150]<1582.1015;0;INT([Calcoli.Q151]/100))","v":20},null,"A",{"$f":"of:=IF([Calcoli.T150]<1582.1015;0;INT([Calcoli.T151]/100))","v":20},null,"A",{"$f":"of:=IF([Calcoli.W150]<1582.1015;0;INT([Calcoli.W151]/100))","v":20},null,"A",{"$f":"of:=IF([Calcoli.Z150]<1582.1015;0;INT([Calcoli.Z151]/100))","v":20},null,"A",{"$f":"of:=IF([Calcoli.AC150]<1582.1015;0;INT([Calcoli.AC151]/100))","v":20},null,"A",{"$f":"of:=IF([Calcoli.AF150]<1582.1015;0;INT([Calcoli.AF151]/100))","v":20},null,"A",{"$f":"of:=IF([Calcoli.AI150]<1582.1015;0;INT([Calcoli.AI151]/100))","v":20},null,"A",{"$f":"of:=IF([Calcoli.AL150]<1582.1015;0;INT([Calcoli.AL151]/100))","v":20},null,"A",{"$f":"of:=IF([Calcoli.AO150]<1582.1015;0;INT([Calcoli.AO151]/100))","v":20}]
["B",{"$f":"of:=IF([Calcoli.B150]<1582.1015;0;2-[Calcoli.B154]+INT([Calcoli.B154]/4))","v":-13},null,"B",{"$f":"of:=IF([Calcoli.E150]<1582.1015;0;2-[Calcoli.E154]+INT([Calcoli.E154]/4))","v":-13},null,"B",{"$f":"of:=IF([Calcoli.H150]<1582.1015;0;2-[Calcoli.H154]+INT([Calcoli.H154]/4))","v":-13},null,"B",{"$f":"of:=IF([Calcoli.K150]<1582.1015;0;2-[Calcoli.K154]+INT([Calcoli.K154]/4))","v":-13},null,"B",{"$f":"of:=IF([Calcoli.N150]<1582.1015;0;2-[Calcoli.N154]+INT([Calcoli.N154]/4))","v":-13},null,"B",{"$f":"of:=IF([Calcoli.Q150]<1582.1015;0;2-[Calcoli.Q154]+INT([Calcoli.Q154]/4))","v":-13},null,"B",{"$f":"of:=IF([Calcoli.T150]<1582.1015;0;2-[Calcoli.T154]+INT([Calcoli.T154]/4))","v":-13},null,"B",{"$f":"of:=IF([Calcoli.W150]<1582.1015;0;2-[Calcoli.W154]+INT([Calcoli.W154]/4))","v":-13},null,"B",{"$f":"of:=IF([Calcoli.Z150]<1582.1015;0;2-[Calcoli.Z154]+INT([Calcoli.Z154]/4))","v":-13},null,"B",{"$f":"of:=IF([Calcoli.AC150]<1582.1015;0;2-[Calcoli.AC154]+INT([Calcoli.AC154]/4))","v":-13},null,"B",{"$f":"of:=IF([Calcoli.AF150]<1582.1015;0;2-[Calcoli.AF154]+INT([Calcoli.AF154]/4))","v":-13},null,"B",{"$f":"of:=IF([Calcoli.AI150]<1582.1015;0;2-[Calcoli.AI154]+INT([Calcoli.AI154]/4))","v":-13},null,"B",{"$f":"of:=IF([Calcoli.AL150]<1582.1015;0;2-[Calcoli.AL154]+INT([Calcoli.AL154]/4))","v":-13},null,"B",{"$f":"of:=IF([Calcoli.AO150]<1582.1015;0;2-[Calcoli.AO154]+INT([Calcoli.AO154]/4))","v":-13}]
["Data_JD",{"$f":"of:=INT(365.25*([Calcoli.B151]+4716))+INT(30.6*([Calcoli.B152]+1))+[Calcoli.B153]+[Calcoli.B155]-1524.5","v":2452944.5},null,"Data_JD",{"$f":"of:=INT(365.25*([Calcoli.E151]+4716))+INT(30.6*([Calcoli.E152]+1))+[Calcoli.E153]+[Calcoli.E155]-1524.5","v":2452944.5},null,"Data_JD",{"$f":"of:=INT(365.25*([Calcoli.H151]+4716))+INT(30.6*([Calcoli.H152]+1))+[Calcoli.H153]+[Calcoli.H155]-1524.5","v":2452944.5},null,"Data_JD",{"$f":"of:=INT(365.25*([Calcoli.K151]+4716))+INT(30.6*([Calcoli.K152]+1))+[Calcoli.K153]+[Calcoli.K155]-1524.5","v":2452944.5},null,"Data_JD",{"$f":"of:=INT(365.25*([Calcoli.N151]+4716))+INT(30.6*([Calcoli.N152]+1))+[Calcoli.N153]+[Calcoli.N155]-1524.5","v":2452944.5},null,"Data_JD",{"$f":"of:=INT(365.25*([Calcoli.Q151]+4716))+INT(30.6*([Calcoli.Q152]+1))+[Calcoli.Q153]+[Calcoli.Q155]-1524.5","v":2452944.5},null,"Data_JD",{"$f":"of:=INT(365.25*([Calcoli.T151]+4716))+INT(30.6*([Calcoli.T152]+1))+[Calcoli.T153]+[Calcoli.T155]-1524.5","v":2452944.5},null,"Data_JD",{"$f":"of:=INT(365.25*([Calcoli.W151]+4716))+INT(30.6*([Calcoli.W152]+1))+[Calcoli.W153]+[Calcoli.W155]-1524.5","v":2452944.5},null,"Data_JD",{"$f":"of:=INT(365.25*([Calcoli.Z151]+4716))+INT(30.6*([Calcoli.Z152]+1))+[Calcoli.Z153]+[Calcoli.Z155]-1524.5","v":2452944.5},null,"Data_JD",{"$f":"of:=INT(365.25*([Calcoli.AC151]+4716))+INT(30.6*([Calcoli.AC152]+1))+[Calcoli.AC153]+[Calcoli.AC155]-1524.5","v":2452944.5},null,"Data_JD",{"$f":"of:=INT(365.25*([Calcoli.AF151]+4716))+INT(30.6*([Calcoli.AF152]+1))+[Calcoli.AF153]+[Calcoli.AF155]-1524.5","v":2452944.5},null,"Data_JD",{"$f":"of:=INT(365.25*([Calcoli.AI151]+4716))+INT(30.6*([Calcoli.AI152]+1))+[Calcoli.AI153]+[Calcoli.AI155]-1524.5","v":2452944.5},null,"Data_JD",{"$f":"of:=INT(365.25*([Calcoli.AL151]+4716))+INT(30.6*([Calcoli.AL152]+1))+[Calcoli.AL153]+[Calcoli.AL155]-1524.5","v":2452944.5},null,"Data_JD",{"$f":"of:=INT(365.25*([Calcoli.AO151]+4716))+INT(30.6*([Calcoli.AO152]+1))+[Calcoli.AO153]+[Calcoli.AO155]-1524.5","v":2452944.5}]
["JD_Data LN",{"$f":"of:=[Calcoli.B146]","v":2457751.7877},null,"JD_Data LN",{"$f":"of:=[Calcoli.E146]","v":2457781.5059},null,"JD_Data LN",{"$f":"of:=[Calcoli.H146]","v":2457811.1253},null,"JD_Data LN",{"$f":"of:=[Calcoli.K146]","v":2457840.6247},null,"JD_Data LN",{"$f":"of:=[Calcoli.N146]","v":2457870.0128},null,"JD_Data LN",{"$f":"of:=[Calcoli.Q146]","v":2457899.324},null,"JD_Data LN",{"$f":"of:=[Calcoli.T146]","v":2457928.6063},null,"JD_Data LN",{"$f":"of:=[Calcoli.W146]","v":2457957.9082},null,"JD_Data LN",{"$f":"of:=[Calcoli.Z146]","v":2457987.2722},null,"JD_Data LN",{"$f":"of:=[Calcoli.AC146]","v":2458016.73},null,"JD_Data LN",{"$f":"of:=[Calcoli.AF146]","v":2458046.3008},null,"JD_Data LN",{"$f":"of:=[Calcoli.AI146]","v":2458075.9885},null,"JD_Data LN",{"$f":"of:=[Calcoli.AL146]","v":2458105.7723},null,"JD_Data LN",{"$f":"of:=[Calcoli.AO146]","v":2458135.5965}]
["Z1",{"$f":"of:=INT([Calcoli.B157]+0.5)","v":2457752},null,"Z1",{"$f":"of:=INT([Calcoli.E157]+0.5)","v":2457782},null,"Z1",{"$f":"of:=INT([Calcoli.H157]+0.5)","v":2457811},null,"Z1",{"$f":"of:=INT([Calcoli.K157]+0.5)","v":2457841},null,"Z1",{"$f":"of:=INT([Calcoli.N157]+0.5)","v":2457870},null,"Z1",{"$f":"of:=INT([Calcoli.Q157]+0.5)","v":2457899},null,"Z1",{"$f":"of:=INT([Calcoli.T157]+0.5)","v":2457929},null,"Z1",{"$f":"of:=INT([Calcoli.W157]+0.5)","v":2457958},null,"Z1",{"$f":"of:=INT([Calcoli.Z157]+0.5)","v":2457987},null,"Z1",{"$f":"of:=INT([Calcoli.AC157]+0.5)","v":2458017},null,"Z1",{"$f":"of:=INT([Calcoli.AF157]+0.5)","v":2458046},null,"Z1",{"$f":"of:=INT([Calcoli.AI157]+0.5)","v":2458076},null,"Z1",{"$f":"of:=INT([Calcoli.AL157]+0.5)","v":2458106},null,"Z1",{"$f":"of:=INT([Calcoli.AO157]+0.5)","v":2458136}]
["F1",{"$f":"of:=[Calcoli.B157]+0.5-INT([Calcoli.B157]+0.5)","v":0.287700000219047},null,"F1",{"$f":"of:=[Calcoli.E157]+0.5-INT([Calcoli.E157]+0.5)","v":0.0059000002220273},null,"F1",{"$f":"of:=[Calcoli.H157]+0.5-INT([Calcoli.H157]+0.5)","v":0.625299999956042},null,"F1",{"$f":"of:=[Calcoli.K157]+0.5-INT([Calcoli.K157]+0.5)","v":0.124700000043958},null,"F1",{"$f":"of:=[Calcoli.N157]+0.5-INT([Calcoli.N157]+0.5)","v":0.512800000142306},null,"F1",{"$f":"of:=[Calcoli.Q157]+0.5-INT([Calcoli.Q157]+0.5)","v":0.824000000022352},null,"F1",{"$f":"of:=[Calcoli.T157]+0.5-INT([Calcoli.T157]+0.5)","v":0.106300000101328},null,"F1",{"$f":"of:=[Calcoli.W157]+0.5-INT([Calcoli.W157]+0.5)","v":0.408199999947101},null,"F1",{"$f":"of:=[Calcoli.Z157]+0.5-INT([Calcoli.Z157]+0.5)","v":0.772200000006706},null,"F1",{"$f":"of:=[Calcoli.AC157]+0.5-INT([Calcoli.AC157]+0.5)","v":0.229999999981374},null,"F1",{"$f":"of:=[Calcoli.AF157]+0.5-INT([Calcoli.AF157]+0.5)","v":0.800799999851733},null,"F1",{"$f":"of:=[Calcoli.AI157]+0.5-INT([Calcoli.AI157]+0.5)","v":0.488499999977648},null,"F1",{"$f":"of:=[Calcoli.AL157]+0.5-INT([Calcoli.AL157]+0.5)","v":0.272299999836832},null,"F1",{"$f":"of:=[Calcoli.AO157]+0.5-INT([Calcoli.AO157]+0.5)","v":0.0964999999850988}]
["Ω1",{"$f":"of:=INT(([Calcoli.B158]-1867216.25)/36524.25)","v":16},null,"Ω1",{"$f":"of:=INT(([Calcoli.E158]-1867216.25)/36524.25)","v":16},null,"Ω1",{"$f":"of:=INT(([Calcoli.H158]-1867216.25)/36524.25)","v":16},null,"Ω1",{"$f":"of:=INT(([Calcoli.K158]-1867216.25)/36524.25)","v":16},null,"Ω1",{"$f":"of:=INT(([Calcoli.N158]-1867216.25)/36524.25)","v":16},null,"Ω1",{"$f":"of:=INT(([Calcoli.Q158]-1867216.25)/36524.25)","v":16},null,"Ω1",{"$f":"of:=INT(([Calcoli.T158]-1867216.25)/36524.25)","v":16},null,"Ω1",{"$f":"of:=INT(([Calcoli.W158]-1867216.25)/36524.25)","v":16},null,"Ω1",{"$f":"of:=INT(([Calcoli.Z158]-1867216.25)/36524.25)","v":16},null,"Ω1",{"$f":"of:=INT(([Calcoli.AC158]-1867216.25)/36524.25)","v":16},null,"Ω1",{"$f":"of:=INT(([Calcoli.AF158]-1867216.25)/36524.25)","v":16},null,"Ω1",{"$f":"of:=INT(([Calcoli.AI158]-1867216.25)/36524.25)","v":16},null,"Ω1",{"$f":"of:=INT(([Calcoli.AL158]-1867216.25)/36524.25)","v":16},null,"Ω1",{"$f":"of:=INT(([Calcoli.AO158]-1867216.25)/36524.25)","v":16}]
["A1",{"$f":"of:=IF([Calcoli.B158]<2299161;[Calcoli.B158];[Calcoli.B158]+1+[Calcoli.B160]-INT([Calcoli.B160]/4))","v":2457765},null,"A1",{"$f":"of:=IF([Calcoli.E158]<2299161;[Calcoli.E158];[Calcoli.E158]+1+[Calcoli.E160]-INT([Calcoli.E160]/4))","v":2457795},null,"A1",{"$f":"of:=IF([Calcoli.H158]<2299161;[Calcoli.H158];[Calcoli.H158]+1+[Calcoli.H160]-INT([Calcoli.H160]/4))","v":2457824},null,"A1",{"$f":"of:=IF([Calcoli.K158]<2299161;[Calcoli.K158];[Calcoli.K158]+1+[Calcoli.K160]-INT([Calcoli.K160]/4))","v":2457854},null,"A1",{"$f":"of:=IF([Calcoli.N158]<2299161;[Calcoli.N158];[Calcoli.N158]+1+[Calcoli.N160]-INT([Calcoli.N160]/4))","v":2457883},null,"A1",{"$f":"of:=IF([Calcoli.Q158]<2299161;[Calcoli.Q158];[Calcoli.Q158]+1+[Calcoli.Q160]-INT([Calcoli.Q160]/4))","v":2457912},null,"A1",{"$f":"of:=IF([Calcoli.T158]<2299161;[Calcoli.T158];[Calcoli.T158]+1+[Calcoli.T160]-INT([Calcoli.T160]/4))","v":2457942},null,"A1",{"$f":"of:=IF([Calcoli.W158]<2299161;[Calcoli.W158];[Calcoli.W158]+1+[Calcoli.W160]-INT([Calcoli.W160]/4))","v":2457971},null,"A1",{"$f":"of:=IF([Calcoli.Z158]<2299161;[Calcoli.Z158];[Calcoli.Z158]+1+[Calcoli.Z160]-INT([Calcoli.Z160]/4))","v":2458000},null,"A1",{"$f":"of:=IF([Calcoli.AC158]<2299161;[Calcoli.AC158];[Calcoli.AC158]+1+[Calcoli.AC160]-INT([Calcoli.AC160]/4))","v":2458030},null,"A1",{"$f":"of:=IF([Calcoli.AF158]<2299161;[Calcoli.AF158];[Calcoli.AF158]+1+[Calcoli.AF160]-INT([Calcoli.AF160]/4))","v":2458059},null,"A1",{"$f":"of:=IF([Calcoli.AI158]<2299161;[Calcoli.AI158];[Calcoli.AI158]+1+[Calcoli.AI160]-INT([Calcoli.AI160]/4))","v":2458089},null,"A1",{"$f":"of:=IF([Calcoli.AL158]<2299161;[Calcoli.AL158];[Calcoli.AL158]+1+[Calcoli.AL160]-INT([Calcoli.AL160]/4))","v":2458119},null,"A1",{"$f":"of:=IF([Calcoli.AO158]<2299161;[Calcoli.AO158];[Calcoli.AO158]+1+[Calcoli.AO160]-INT([Calcoli.AO160]/4))","v":2458149}]
["B1",{"$f":"of:=[Calcoli.B161]+1524","v":2459289},null,"B1",{"$f":"of:=[Calcoli.E161]+1524","v":2459319},null,"B1",{"$f":"of:=[Calcoli.H161]+1524","v":2459348},null,"B1",{"$f":"of:=[Calcoli.K161]+1524","v":2459378},null,"B1",{"$f":"of:=[Calcoli.N161]+1524","v":2459407},null,"B1",{"$f":"of:=[Calcoli.Q161]+1524","v":2459436},null,"B1",{"$f":"of:=[Calcoli.T161]+1524","v":2459466},null,"B1",{"$f":"of:=[Calcoli.W161]+1524","v":2459495},null,"B1",{"$f":"of:=[Calcoli.Z161]+1524","v":2459524},null,"B1",{"$f":"of:=[Calcoli.AC161]+1524","v":2459554},null,"B1",{"$f":"of:=[Calcoli.AF161]+1524","v":2459583},null,"B1",{"$f":"of:=[Calcoli.AI161]+1524","v":2459613},null,"B1",{"$f":"of:=[Calcoli.AL161]+1524","v":2459643},null,"B1",{"$f":"of:=[Calcoli.AO161]+1524","v":2459673}]
["C1",{"$f":"of:=INT(([Calcoli.B162]-122.1)/365.25)","v":6732},null,"C1",{"$f":"of:=INT(([Calcoli.E162]-122.1)/365.25)","v":6732},null,"C1",{"$f":"of:=INT(([Calcoli.H162]-122.1)/365.25)","v":6732},null,"C1",{"$f":"of:=INT(([Calcoli.K162]-122.1)/365.25)","v":6733},null,"C1",{"$f":"of:=INT(([Calcoli.N162]-122.1)/365.25)","v":6733},null,"C1",{"$f":"of:=INT(([Calcoli.Q162]-122.1)/365.25)","v":6733},null,"C1",{"$f":"of:=INT(([Calcoli.T162]-122.1)/365.25)","v":6733},null,"C1",{"$f":"of:=INT(([Calcoli.W162]-122.1)/365.25)","v":6733},null,"C1",{"$f":"of:=INT(([Calcoli.Z162]-122.1)/365.25)","v":6733},null,"C1",{"$f":"of:=INT(([Calcoli.AC162]-122.1)/365.25)","v":6733},null,"C1",{"$f":"of:=INT(([Calcoli.AF162]-122.1)/365.25)","v":6733},null,"C1",{"$f":"of:=INT(([Calcoli.AI162]-122.1)/365.25)","v":6733},null,"C1",{"$f":"of:=INT(([Calcoli.AL162]-122.1)/365.25)","v":6733},null,"C1",{"$f":"of:=INT(([Calcoli.AO162]-122.1)/365.25)","v":6733}]
["D1",{"$f":"of:=INT(365.25*[Calcoli.B163])","v":2458863},null,"D1",{"$f":"of:=INT(365.25*[Calcoli.E163])","v":2458863},null,"D1",{"$f":"of:=INT(365.25*[Calcoli.H163])","v":2458863},null,"D1",{"$f":"of:=INT(365.25*[Calcoli.K163])","v":2459228},null,"D1",{"$f":"of:=INT(365.25*[Calcoli.N163])","v":2459228},null,"D1",{"$f":"of:=INT(365.25*[Calcoli.Q163])","v":2459228},null,"D1",{"$f":"of:=INT(365.25*[Calcoli.T163])","v":2459228},null,"D1",{"$f":"of:=INT(365.25*[Calcoli.W163])","v":2459228},null,"D1",{"$f":"of:=INT(365.25*[Calcoli.Z163])","v":2459228},null,"D1",{"$f":"of:=INT(365.25*[Calcoli.AC163])","v":2459228},null,"D1",{"$f":"of:=INT(365.25*[Calcoli.AF163])","v":2459228},null,"D1",{"$f":"of:=INT(365.25*[Calcoli.AI163])","v":2459228},null,"D1",{"$f":"of:=INT(365.25*[Calcoli.AL163])","v":2459228},null,"D1",{"$f":"of:=INT(365.25*[Calcoli.AO163])","v":2459228}]
["E1",{"$f":"of:=INT(([Calcoli.B162]-[Calcoli.B164])/30.6001)","v":13},null,"E1",{"$f":"of:=INT(([Calcoli.E162]-[Calcoli.E164])/30.6001)","v":14},null,"E1",{"$f":"of:=INT(([Calcoli.H162]-[Calcoli.H164])/30.6001)","v":15},null,"E1",{"$f":"of:=INT(([Calcoli.K162]-[Calcoli.K164])/30.6001)","v":4},null,"E1",{"$f":"of:=INT(([Calcoli.N162]-[Calcoli.N164])/30.6001)","v":5},null,"E1",{"$f":"of:=INT(([Calcoli.Q162]-[Calcoli.Q164])/30.6001)","v":6},null,"E1",{"$f":"of:=INT(([Calcoli.T162]-[Calcoli.T164])/30.6001)","v":7},null,"E1",{"$f":"of:=INT(([Calcoli.W162]-[Calcoli.W164])/30.6001)","v":8},null,"E1",{"$f":"of:=INT(([Calcoli.Z162]-[Calcoli.Z164])/30.6001)","v":9},null,"E1",{"$f":"of:=INT(([Calcoli.AC162]-[Calcoli.AC164])/30.6001)","v":10},null,"E1",{"$f":"of:=INT(([Calcoli.AF162]-[Calcoli.AF164])/30.6001)","v":11},null,"E1",{"$f":"of:=INT(([Calcoli.AI162]-[Calcoli.AI164])/30.6001)","v":12},null,"E1",{"$f":"of:=INT(([Calcoli.AL162]-[Calcoli.AL164])/30.6001)","v":13},null,"E1",{"$f":"of:=INT(([Calcoli.AO162]-[Calcoli.AO164])/30.6001)","v":14}]
["Giorno_LN",{"$f":"of:=ROUND([Calcoli.B162]-[Calcoli.B164]-INT(30.6001*[Calcoli.B165])+[Calcoli.B159];4)","v":29.2877},null,"Giorno_LN",{"$f":"of:=ROUND([Calcoli.E162]-[Calcoli.E164]-INT(30.6001*[Calcoli.E165])+[Calcoli.E159];4)","v":28.0059},null,"Giorno_LN",{"$f":"of:=ROUND([Calcoli.H162]-[Calcoli.H164]-INT(30.6001*[Calcoli.H165])+[Calcoli.H159];4)","v":26.6253},null,"Giorno_LN",{"$f":"of:=ROUND([Calcoli.K162]-[Calcoli.K164]-INT(30.6001*[Calcoli.K165])+[Calcoli.K159];4)","v":28.1247},null,"Giorno_LN",{"$f":"of:=ROUND([Calcoli.N162]-[Calcoli.N164]-INT(30.6001*[Calcoli.N165])+[Calcoli.N159];4)","v":26.5128},null,"Giorno_LN",{"$f":"of:=ROUND([Calcoli.Q162]-[Calcoli.Q164]-INT(30.6001*[Calcoli.Q165])+[Calcoli.Q159];4)","v":25.824},null,"Giorno_LN",{"$f":"of:=ROUND([Calcoli.T162]-[Calcoli.T164]-INT(30.6001*[Calcoli.T165])+[Calcoli.T159];4)","v":24.1063},null,"Giorno_LN",{"$f":"of:=ROUND([Calcoli.W162]-[Calcoli.W164]-INT(30.6001*[Calcoli.W165])+[Calcoli.W159];4)","v":23.4082},null,"Giorno_LN",{"$f":"of:=ROUND([Calcoli.Z162]-[Calcoli.Z164]-INT(30.6001*[Calcoli.Z165])+[Calcoli.Z159];4)","v":21.7722},null,"Giorno_LN",{"$f":"of:=ROUND([Calcoli.AC162]-[Calcoli.AC164]-INT(30.6001*[Calcoli.AC165])+[Calcoli.AC159];4)","v":20.23},null,"Giorno_LN",{"$f":"of:=ROUND([Calcoli.AF162]-[Calcoli.AF164]-INT(30.6001*[Calcoli.AF165])+[Calcoli.AF159];4)","v":19.8008},null,"Giorno_LN",{"$f":"of:=ROUND([Calcoli.AI162]-[Calcoli.AI164]-INT(30.6001*[Calcoli.AI165])+[Calcoli.AI159];4)","v":18.4885},null,"Giorno_LN",{"$f":"of:=ROUND([Calcoli.AL162]-[Calcoli.AL164]-INT(30.6001*[Calcoli.AL165])+[Calcoli.AL159];4)","v":18.2723},null,"Giorno_LN",{"$f":"of:=ROUND([Calcoli.AO162]-[Calcoli.AO164]-INT(30.6001*[Calcoli.AO165])+[Calcoli.AO159];4)","v":17.0965}]
["Mese_LN",{"$f":"of:=IF([Calcoli.B165]<13.5;[Calcoli.B165]-1;[Calcoli.B165]-13)","v":12},null,"Mese_LN",{"$f":"of:=IF([Calcoli.E165]<13.5;[Calcoli.E165]-1;[Calcoli.E165]-13)","v":1},null,"Mese_LN",{"$f":"of:=IF([Calcoli.H165]<13.5;[Calcoli.H165]-1;[Calcoli.H165]-13)","v":2},null,"Mese_LN",{"$f":"of:=IF([Calcoli.K165]<13.5;[Calcoli.K165]-1;[Calcoli.K165]-13)","v":3},null,"Mese_LN",{"$f":"of:=IF([Calcoli.N165]<13.5;[Calcoli.N165]-1;[Calcoli.N165]-13)","v":4},null,"Mese_LN",{"$f":"of:=IF([Calcoli.Q165]<13.5;[Calcoli.Q165]-1;[Calcoli.Q165]-13)","v":5},null,"Mese_LN",{"$f":"of:=IF([Calcoli.T165]<13.5;[Calcoli.T165]-1;[Calcoli.T165]-13)","v":6},null,"Mese_LN",{"$f":"of:=IF([Calcoli.W165]<13.5;[Calcoli.W165]-1;[Calcoli.W165]-13)","v":7},null,"Mese_LN",{"$f":"of:=IF([Calcoli.Z165]<13.5;[Calcoli.Z165]-1;[Calcoli.Z165]-13)","v":8},null,"Mese_LN",{"$f":"of:=IF([Calcoli.AC165]<13.5;[Calcoli.AC165]-1;[Calcoli.AC165]-13)","v":9},null,"Mese_LN",{"$f":"of:=IF([Calcoli.AF165]<13.5;[Calcoli.AF165]-1;[Calcoli.AF165]-13)","v":10},null,"Mese_LN",{"$f":"of:=IF([Calcoli.AI165]<13.5;[Calcoli.AI165]-1;[Calcoli.AI165]-13)","v":11},null,"Mese_LN",{"$f":"of:=IF([Calcoli.AL165]<13.5;[Calcoli.AL165]-1;[Calcoli.AL165]-13)","v":12},null,"Mese_LN",{"$f":"of:=IF([Calcoli.AO165]<13.5;[Calcoli.AO165]-1;[Calcoli.AO165]-13)","v":1}]
["ANNO_LN",{"$f":"of:=IF([Calcoli.B167]>2.5 AND([Calcoli.B167]<12.5);[Calcoli.B163]-4716;[Calcoli.B163]-4715)","v":2016},null,"ANNO_LN",{"$f":"of:=IF([Calcoli.E167]>2.5 AND([Calcoli.E167]<12.5);[Calcoli.E163]-4716;[Calcoli.E163]-4715)","v":2017},null,"ANNO_LN",{"$f":"of:=IF([Calcoli.H167]>2.5 AND([Calcoli.H167]<12.5);[Calcoli.H163]-4716;[Calcoli.H163]-4715)","v":2017},null,"ANNO_LN",{"$f":"of:=IF([Calcoli.K167]>2.5 AND([Calcoli.K167]<12.5);[Calcoli.K163]-4716;[Calcoli.K163]-4715)","v":2017},null,"ANNO_LN",{"$f":"of:=IF([Calcoli.N167]>2.5 AND([Calcoli.N167]<12.5);[Calcoli.N163]-4716;[Calcoli.N163]-4715)","v":2017},null,"ANNO_LN",{"$f":"of:=IF([Calcoli.Q167]>2.5 AND([Calcoli.Q167]<12.5);[Calcoli.Q163]-4716;[Calcoli.Q163]-4715)","v":2017},null,"ANNO_LN",{"$f":"of:=IF([Calcoli.T167]>2.5 AND([Calcoli.T167]<12.5);[Calcoli.T163]-4716;[Calcoli.T163]-4715)","v":2017},null,"ANNO_LN",{"$f":"of:=IF([Calcoli.W167]>2.5 AND([Calcoli.W167]<12.5);[Calcoli.W163]-4716;[Calcoli.W163]-4715)","v":2017},null,"ANNO_LN",{"$f":"of:=IF([Calcoli.Z167]>2.5 AND([Calcoli.Z167]<12.5);[Calcoli.Z163]-4716;[Calcoli.Z163]-4715)","v":2017},null,"ANNO_LN",{"$f":"of:=IF([Calcoli.AC167]>2.5 AND([Calcoli.AC167]<12.5);[Calcoli.AC163]-4716;[Calcoli.AC163]-4715)","v":2017},null,"ANNO_LN",{"$f":"of:=IF([Calcoli.AF167]>2.5 AND([Calcoli.AF167]<12.5);[Calcoli.AF163]-4716;[Calcoli.AF163]-4715)","v":2017},null,"ANNO_LN",{"$f":"of:=IF([Calcoli.AI167]>2.5 AND([Calcoli.AI167]<12.5);[Calcoli.AI163]-4716;[Calcoli.AI163]-4715)","v":2017},null,"ANNO_LN",{"$f":"of:=IF([Calcoli.AL167]>2.5 AND([Calcoli.AL167]<12.5);[Calcoli.AL163]-4716;[Calcoli.AL163]-4715)","v":2017},null,"ANNO_LN",{"$f":"of:=IF([Calcoli.AO167]>2.5 AND([Calcoli.AO167]<12.5);[Calcoli.AO163]-4716;[Calcoli.AO163]-4715)","v":2018}]
["Data_GD LN",{"$f":"of:=DATE([Calcoli.B168];[Calcoli.B167];[Calcoli.B166])","v":"2016-12-29"},null,"Data_GD LN",{"$f":"of:=DATE([Calcoli.E168];[Calcoli.E167];[Calcoli.E166])","v":"2017-01-28"},null,"Data_GD LN",{"$f":"of:=DATE([Calcoli.H168];[Calcoli.H167];[Calcoli.H166])","v":"2017-02-26"},null,"Data_GD LN",{"$f":"of:=DATE([Calcoli.K168];[Calcoli.K167];[Calcoli.K166])","v":"2017-03-28"},null,"Data_GD LN",{"$f":"of:=DATE([Calcoli.N168];[Calcoli.N167];[Calcoli.N166])","v":"2017-04-26"},null,"Data_GD LN",{"$f":"of:=DATE([Calcoli.Q168];[Calcoli.Q167];[Calcoli.Q166])","v":"2017-05-25"},null,"Data_GD LN",{"$f":"of:=DATE([Calcoli.T168];[Calcoli.T167];[Calcoli.T166])","v":"2017-06-24"},null,"Data_GD LN",{"$f":"of:=DATE([Calcoli.W168];[Calcoli.W167];[Calcoli.W166])","v":"2017-07-23"},null,"Data_GD LN",{"$f":"of:=DATE([Calcoli.Z168];[Calcoli.Z167];[Calcoli.Z166])","v":"2017-08-21"},null,"Data_GD LN",{"$f":"of:=DATE([Calcoli.AC168];[Calcoli.AC167];[Calcoli.AC166])","v":"2017-09-20"},null,"Data_GD LN",{"$f":"of:=DATE([Calcoli.AF168];[Calcoli.AF167];[Calcoli.AF166])","v":"2017-10-19"},null,"Data_GD LN",{"$f":"of:=DATE([Calcoli.AI168];[Calcoli.AI167];[Calcoli.AI166])","v":"2017-11-18"},null,"Data_GD LN",{"$f":"of:=DATE([Calcoli.AL168];[Calcoli.AL167];[Calcoli.AL166])","v":"2017-12-18"},null,"Data_GD LN",{"$f":"of:=DATE([Calcoli.AO168];[Calcoli.AO167];[Calcoli.AO166])","v":"2018-01-17"}]
["Ore_GD LN",{"$f":"of:=INT(([Calcoli.B166]-INT([Calcoli.B166]))*24)+1","v":7},null,"Ore_GD LN",{"$f":"of:=INT(([Calcoli.E166]-INT([Calcoli.E166]))*24)+1","v":1},null,"Ore_GD LN",{"$f":"of:=INT(([Calcoli.H166]-INT([Calcoli.H166]))*24)+1","v":16},null,"Ore_GD LN",{"$f":"of:=INT(([Calcoli.K166]-INT([Calcoli.K166]))*24)+1","v":3},null,"Ore_GD LN",{"$f":"of:=INT(([Calcoli.N166]-INT([Calcoli.N166]))*24)+1","v":13},null,"Ore_GD LN",{"$f":"of:=INT(([Calcoli.Q166]-INT([Calcoli.Q166]))*24)+1","v":20},null,"Ore_GD LN",{"$f":"of:=INT(([Calcoli.T166]-INT([Calcoli.T166]))*24)+1","v":3},null,"Ore_GD LN",{"$f":"of:=INT(([Calcoli.W166]-INT([Calcoli.W166]))*24)+1","v":10},null,"Ore_GD LN",{"$f":"of:=INT(([Calcoli.Z166]-INT([Calcoli.Z166]))*24)+1","v":19},null,"Ore_GD LN",{"$f":"of:=INT(([Calcoli.AC166]-INT([Calcoli.AC166]))*24)+1","v":6},null,"Ore_GD LN",{"$f":"of:=INT(([Calcoli.AF166]-INT([Calcoli.AF166]))*24)+1","v":20},null,"Ore_GD LN",{"$f":"of:=INT(([Calcoli.AI166]-INT([Calcoli.AI166]))*24)+1","v":12},null,"Ore_GD LN",{"$f":"of:=INT(([Calcoli.AL166]-INT([Calcoli.AL166]))*24)+1","v":7},null,"Ore_GD LN",{"$f":"of:=INT(([Calcoli.AO166]-INT([Calcoli.AO166]))*24)+1","v":3}]
["Minuti_GD LN",{"$f":"of:=INT((([Calcoli.B166]-INT([Calcoli.B166]))*24-([Calcoli.B170]-1))*60)","v":54},null,"Minuti_GD LN",{"$f":"of:=INT((([Calcoli.E166]-INT([Calcoli.E166]))*24-([Calcoli.E170]-1))*60)","v":8},null,"Minuti_GD LN",{"$f":"of:=INT((([Calcoli.H166]-INT([Calcoli.H166]))*24-([Calcoli.H170]-1))*60)","v":0},null,"Minuti_GD LN",{"$f":"of:=INT((([Calcoli.K166]-INT([Calcoli.K166]))*24-([Calcoli.K170]-1))*60)","v":59},null,"Minuti_GD LN",{"$f":"of:=INT((([Calcoli.N166]-INT([Calcoli.N166]))*24-([Calcoli.N170]-1))*60)","v":18},null,"Minuti_GD LN",{"$f":"of:=INT((([Calcoli.Q166]-INT([Calcoli.Q166]))*24-([Calcoli.Q170]-1))*60)","v":46},null,"Minuti_GD LN",{"$f":"of:=INT((([Calcoli.T166]-INT([Calcoli.T166]))*24-([Calcoli.T170]-1))*60)","v":33},null,"Minuti_GD LN",{"$f":"of:=INT((([Calcoli.W166]-INT([Calcoli.W166]))*24-([Calcoli.W170]-1))*60)","v":47},null,"Minuti_GD LN",{"$f":"of:=INT((([Calcoli.Z166]-INT([Calcoli.Z166]))*24-([Calcoli.Z170]-1))*60)","v":31},null,"Minuti_GD LN",{"$f":"of:=INT((([Calcoli.AC166]-INT([Calcoli.AC166]))*24-([Calcoli.AC170]-1))*60)","v":31},null,"Minuti_GD LN",{"$f":"of:=INT((([Calcoli.AF166]-INT([Calcoli.AF166]))*24-([Calcoli.AF170]-1))*60)","v":13},null,"Minuti_GD LN",{"$f":"of:=INT((([Calcoli.AI166]-INT([Calcoli.AI166]))*24-([Calcoli.AI170]-1))*60)","v":43},null,"Minuti_GD LN",{"$f":"of:=INT((([Calcoli.AL166]-INT([Calcoli.AL166]))*24-([Calcoli.AL170]-1))*60)","v":32},null,"Minuti_GD LN",{"$f":"of:=INT((([Calcoli.AO166]-INT([Calcoli.AO166]))*24-([Calcoli.AO170]-1))*60)","v":18}]
["Secondi_GD LN",{"$f":"of:=INT((((([Calcoli.B166]-INT([Calcoli.B166]))*24-([Calcoli.B170]-1))*60)-[Calcoli.B171])*60)","v":17},null,"Secondi_GD LN",{"$f":"of:=INT((((([Calcoli.E166]-INT([Calcoli.E166]))*24-([Calcoli.E170]-1))*60)-[Calcoli.E171])*60)","v":29},null,"Secondi_GD LN",{"$f":"of:=INT((((([Calcoli.H166]-INT([Calcoli.H166]))*24-([Calcoli.H170]-1))*60)-[Calcoli.H171])*60)","v":25},null,"Secondi_GD LN",{"$f":"of:=INT((((([Calcoli.K166]-INT([Calcoli.K166]))*24-([Calcoli.K170]-1))*60)-[Calcoli.K171])*60)","v":34},null,"Secondi_GD LN",{"$f":"of:=INT((((([Calcoli.N166]-INT([Calcoli.N166]))*24-([Calcoli.N170]-1))*60)-[Calcoli.N171])*60)","v":25},null,"Secondi_GD LN",{"$f":"of:=INT((((([Calcoli.Q166]-INT([Calcoli.Q166]))*24-([Calcoli.Q170]-1))*60)-[Calcoli.Q171])*60)","v":33},null,"Secondi_GD LN",{"$f":"of:=INT((((([Calcoli.T166]-INT([Calcoli.T166]))*24-([Calcoli.T170]-1))*60)-[Calcoli.T171])*60)","v":4},null,"Secondi_GD LN",{"$f":"of:=INT((((([Calcoli.W166]-INT([Calcoli.W166]))*24-([Calcoli.W170]-1))*60)-[Calcoli.W171])*60)","v":48},null,"Secondi_GD LN",{"$f":"of:=INT((((([Calcoli.Z166]-INT([Calcoli.Z166]))*24-([Calcoli.Z170]-1))*60)-[Calcoli.Z171])*60)","v":58},null,"Secondi_GD LN",{"$f":"of:=INT((((([Calcoli.AC166]-INT([Calcoli.AC166]))*24-([Calcoli.AC170]-1))*60)-[Calcoli.AC171])*60)","v":12},null,"Secondi_GD LN",{"$f":"of:=INT((((([Calcoli.AF166]-INT([Calcoli.AF166]))*24-([Calcoli.AF170]-1))*60)-[Calcoli.AF171])*60)","v":9},null,"Secondi_GD LN",{"$f":"of:=INT((((([Calcoli.AI166]-INT([Calcoli.AI166]))*24-([Calcoli.AI170]-1))*60)-[Calcoli.AI171])*60)","v":26},null,"Secondi_GD LN",{"$f":"of:=INT((((([Calcoli.AL166]-INT([Calcoli.AL166]))*24-([Calcoli.AL170]-1))*60)-[Calcoli.AL171])*60)","v":6},null,"Secondi_GD LN",{"$f":"of:=INT((((([Calcoli.AO166]-INT([Calcoli.AO166]))*24-([Calcoli.AO170]-1))*60)-[Calcoli.AO171])*60)","v":57}]
["JD_Data PQ",{"$f":"of:=[Calcoli.B147]","v":2457759.3222},null,"JD_Data PQ",{"$f":"of:=[Calcoli.E147]","v":2457788.6777},null,"JD_Data PQ",{"$f":"of:=[Calcoli.H147]","v":2457817.9789},null,"JD_Data PQ",{"$f":"of:=[Calcoli.K147]","v":2457847.2756},null,"JD_Data PQ",{"$f":"of:=[Calcoli.N147]","v":2457876.6139},null,"JD_Data PQ",{"$f":"of:=[Calcoli.Q147]","v":2457906.0269},null,"JD_Data PQ",{"$f":"of:=[Calcoli.T147]","v":2457935.5331},null,"JD_Data PQ",{"$f":"of:=[Calcoli.W147]","v":2457965.1389},null,"JD_Data PQ",{"$f":"of:=[Calcoli.Z147]","v":2457994.8409},null,"JD_Data PQ",{"$f":"of:=[Calcoli.AC147]","v":2458024.6194},null,"JD_Data PQ",{"$f":"of:=[Calcoli.AF147]","v":2458054.4308},null,"JD_Data PQ",{"$f":"of:=[Calcoli.AI147]","v":2458084.2088},null,"JD_Data PQ",{"$f":"of:=[Calcoli.AL147]","v":2458113.8871},null,"JD_Data PQ",{"$f":"of:=[Calcoli.AO147]","v":2458143.4289}]
["Z2",{"$f":"of:=INT([Calcoli.B173]+0.5)","v":2457759},null,"Z2",{"$f":"of:=INT([Calcoli.E173]+0.5)","v":2457789},null,"Z2",{"$f":"of:=INT([Calcoli.H173]+0.5)","v":2457818},null,"Z2",{"$f":"of:=INT([Calcoli.K173]+0.5)","v":2457847},null,"Z2",{"$f":"of:=INT([Calcoli.N173]+0.5)","v":2457877},null,"Z2",{"$f":"of:=INT([Calcoli.Q173]+0.5)","v":2457906},null,"Z2",{"$f":"of:=INT([Calcoli.T173]+0.5)","v":2457936},null,"Z2",{"$f":"of:=INT([Calcoli.W173]+0.5)","v":2457965},null,"Z2",{"$f":"of:=INT([Calcoli.Z173]+0.5)","v":2457995},null,"Z2",{"$f":"of:=INT([Calcoli.AC173]+0.5)","v":2458025},null,"Z2",{"$f":"of:=INT([Calcoli.AF173]+0.5)","v":2458054},null,"Z2",{"$f":"of:=INT([Calcoli.AI173]+0.5)","v":2458084},null,"Z2",{"$f":"of:=INT([Calcoli.AL173]+0.5)","v":2458114},null,"Z2",{"$f":"of:=INT([Calcoli.AO173]+0.5)","v":2458143}]
["F2",{"$f":"of:=[Calcoli.B173]+0.5-INT([Calcoli.B173]+0.5)","v":0.822199999820441},null,"F2",{"$f":"of:=[Calcoli.E173]+0.5-INT([Calcoli.E173]+0.5)","v":0.177699999883771},null,"F2",{"$f":"of:=[Calcoli.H173]+0.5-INT([Calcoli.H173]+0.5)","v":0.478899999987334},null,"F2",{"$f":"of:=[Calcoli.K173]+0.5-INT([Calcoli.K173]+0.5)","v":0.775599999818951},null,"F2",{"$f":"of:=[Calcoli.N173]+0.5-INT([Calcoli.N173]+0.5)","v":0.113900000229478},null,"F2",{"$f":"of:=[Calcoli.Q173]+0.5-INT([Calcoli.Q173]+0.5)","v":0.526899999938905},null,"F2",{"$f":"of:=[Calcoli.T173]+0.5-INT([Calcoli.T173]+0.5)","v":0.0331000001169741},null,"F2",{"$f":"of:=[Calcoli.W173]+0.5-INT([Calcoli.W173]+0.5)","v":0.638900000136346},null,"F2",{"$f":"of:=[Calcoli.Z173]+0.5-INT([Calcoli.Z173]+0.5)","v":0.340900000184774},null,"F2",{"$f":"of:=[Calcoli.AC173]+0.5-INT([Calcoli.AC173]+0.5)","v":0.119400000199676},null,"F2",{"$f":"of:=[Calcoli.AF173]+0.5-INT([Calcoli.AF173]+0.5)","v":0.930800000205636},null,"F2",{"$f":"of:=[Calcoli.AI173]+0.5-INT([Calcoli.AI173]+0.5)","v":0.708800000138581},null,"F2",{"$f":"of:=[Calcoli.AL173]+0.5-INT([Calcoli.AL173]+0.5)","v":0.387099999934435},null,"F2",{"$f":"of:=[Calcoli.AO173]+0.5-INT([Calcoli.AO173]+0.5)","v":0.928900000173599}]
["Ω2",{"$f":"of:=INT(([Calcoli.B174]-1867216.25)/36524.25)","v":16},null,"Ω2",{"$f":"of:=INT(([Calcoli.E174]-1867216.25)/36524.25)","v":16},null,"Ω2",{"$f":"of:=INT(([Calcoli.H174]-1867216.25)/36524.25)","v":16},null,"Ω2",{"$f":"of:=INT(([Calcoli.K174]-1867216.25)/36524.25)","v":16},null,"Ω2",{"$f":"of:=INT(([Calcoli.N174]-1867216.25)/36524.25)","v":16},null,"Ω2",{"$f":"of:=INT(([Calcoli.Q174]-1867216.25)/36524.25)","v":16},null,"Ω2",{"$f":"of:=INT(([Calcoli.T174]-1867216.25)/36524.25)","v":16},null,"Ω2",{"$f":"of:=INT(([Calcoli.W174]-1867216.25)/36524.25)","v":16},null,"Ω2",{"$f":"of:=INT(([Calcoli.Z174]-1867216.25)/36524.25)","v":16},null,"Ω2",{"$f":"of:=INT(([Calcoli.AC174]-1867216.25)/36524.25)","v":16},null,"Ω2",{"$f":"of:=INT(([Calcoli.AF174]-1867216.25)/36524.25)","v":16},null,"Ω2",{"$f":"of:=INT(([Calcoli.AI174]-1867216.25)/36524.25)","v":16},null,"Ω2",{"$f":"of:=INT(([Calcoli.AL174]-1867216.25)/36524.25)","v":16},null,"Ω2",{"$f":"of:=INT(([Calcoli.AO174]-1867216.25)/36524.25)","v":16}]
["A2",{"$f":"of:=IF([Calcoli.B174]<2299161;[Calcoli.B174];[Calcoli.B174]+1+[Calcoli.B176]-INT([Calcoli.B176]/4))","v":2457772},null,"A2",{"$f":"of:=IF([Calcoli.E174]<2299161;[Calcoli.E174];[Calcoli.E174]+1+[Calcoli.E176]-INT([Calcoli.E176]/4))","v":2457802},null,"A2",{"$f":"of:=IF([Calcoli.H174]<2299161;[Calcoli.H174];[Calcoli.H174]+1+[Calcoli.H176]-INT([Calcoli.H176]/4))","v":2457831},null,"A2",{"$f":"of:=IF([Calcoli.K174]<2299161;[Calcoli.K174];[Calcoli.K174]+1+[Calcoli.K176]-INT([Calcoli.K176]/4))","v":2457860},null,"A2",{"$f":"of:=IF([Calcoli.N174]<2299161;[Calcoli.N174];[Calcoli.N174]+1+[Calcoli.N176]-INT([Calcoli.N176]/4))","v":2457890},null,"A2",{"$f":"of:=IF([Calcoli.Q174]<2299161;[Calcoli.Q174];[Calcoli.Q174]+1+[Calcoli.Q176]-INT([Calcoli.Q176]/4))","v":2457919},null,"A2",{"$f":"of:=IF([Calcoli.T174]<2299161;[Calcoli.T174];[Calcoli.T174]+1+[Calcoli.T176]-INT([Calcoli.T176]/4))","v":2457949},null,"A2",{"$f":"of:=IF([Calcoli.W174]<2299161;[Calcoli.W174];[Calcoli.W174]+1+[Calcoli.W176]-INT([Calcoli.W176]/4))","v":2457978},null,"A2",{"$f":"of:=IF([Calcoli.Z174]<2299161;[Calcoli.Z174];[Calcoli.Z174]+1+[Calcoli.Z176]-INT([Calcoli.Z176]/4))","v":2458008},null,"A2",{"$f":"of:=IF([Calcoli.AC174]<2299161;[Calcoli.AC174];[Calcoli.AC174]+1+[Calcoli.AC176]-INT([Calcoli.AC176]/4))","v":2458038},null,"A2",{"$f":"of:=IF([Calcoli.AF174]<2299161;[Calcoli.AF174];[Calcoli.AF174]+1+[Calcoli.AF176]-INT([Calcoli.AF176]/4))","v":2458067},null,"A2",{"$f":"of:=IF([Calcoli.AI174]<2299161;[Calcoli.AI174];[Calcoli.AI174]+1+[Calcoli.AI176]-INT([Calcoli.AI176]/4))","v":2458097},null,"A2",{"$f":"of:=IF([Calcoli.AL174]<2299161;[Calcoli.AL174];[Calcoli.AL174]+1+[Calcoli.AL176]-INT([Calcoli.AL176]/4))","v":2458127},null,"A2",{"$f":"of:=IF([Calcoli.AO174]<2299161;[Calcoli.AO174];[Calcoli.AO174]+1+[Calcoli.AO176]-INT([Calcoli.AO176]/4))","v":2458156}]
["B2",{"$f":"of:=[Calcoli.B177]+1524","v":2459296},null,"B2",{"$f":"of:=[Calcoli.E177]+1524","v":2459326},null,"B2",{"$f":"of:=[Calcoli.H177]+1524","v":2459355},null,"B2",{"$f":"of:=[Calcoli.K177]+1524","v":2459384},null,"B2",{"$f":"of:=[Calcoli.N177]+1524","v":2459414},null,"B2",{"$f":"of:=[Calcoli.Q177]+1524","v":2459443},null,"B2",{"$f":"of:=[Calcoli.T177]+1524","v":2459473},null,"B2",{"$f":"of:=[Calcoli.W177]+1524","v":2459502},null,"B2",{"$f":"of:=[Calcoli.Z177]+1524","v":2459532},null,"B2",{"$f":"of:=[Calcoli.AC177]+1524","v":2459562},null,"B2",{"$f":"of:=[Calcoli.AF177]+1524","v":2459591},null,"B2",{"$f":"of:=[Calcoli.AI177]+1524","v":2459621},null,"B2",{"$f":"of:=[Calcoli.AL177]+1524","v":2459651},null,"B2",{"$f":"of:=[Calcoli.AO177]+1524","v":2459680}]
["C2",{"$f":"of:=INT(([Calcoli.B178]-122.1)/365.25)","v":6732},null,"C2",{"$f":"of:=INT(([Calcoli.E178]-122.1)/365.25)","v":6732},null,"C2",{"$f":"of:=INT(([Calcoli.H178]-122.1)/365.25)","v":6733},null,"C2",{"$f":"of:=INT(([Calcoli.K178]-122.1)/365.25)","v":6733},null,"C2",{"$f":"of:=INT(([Calcoli.N178]-122.1)/365.25)","v":6733},null,"C2",{"$f":"of:=INT(([Calcoli.Q178]-122.1)/365.25)","v":6733},null,"C2",{"$f":"of:=INT(([Calcoli.T178]-122.1)/365.25)","v":6733},null,"C2",{"$f":"of:=INT(([Calcoli.W178]-122.1)/365.25)","v":6733},null,"C2",{"$f":"of:=INT(([Calcoli.Z178]-122.1)/365.25)","v":6733},null,"C2",{"$f":"of:=INT(([Calcoli.AC178]-122.1)/365.25)","v":6733},null,"C2",{"$f":"of:=INT(([Calcoli.AF178]-122.1)/365.25)","v":6733},null,"C2",{"$f":"of:=INT(([Calcoli.AI178]-122.1)/365.25)","v":6733},null,"C2",{"$f":"of:=INT(([Calcoli.AL178]-122.1)/365.25)","v":6733},null,"C2",{"$f":"of:=INT(([Calcoli.AO178]-122.1)/365.25)","v":6733}]
["D2",{"$f":"of:=INT(365.25*[Calcoli.B179])","v":2458863},null,"D2",{"$f":"of:=INT(365.25*[Calcoli.E179])","v":2458863},null,"D2",{"$f":"of:=INT(365.25*[Calcoli.H179])","v":2459228},null,"D2",{"$f":"of:=INT(365.25*[Calcoli.K179])","v":2459228},null,"D2",{"$f":"of:=INT(365.25*[Calcoli.N179])","v":2459228},null,"D2",{"$f":"of:=INT(365.25*[Calcoli.Q179])","v":2459228},null,"D2",{"$f":"of:=INT(365.25*[Calcoli.T179])","v":2459228},null,"D2",{"$f":"of:=INT(365.25*[Calcoli.W179])","v":2459228},null,"D2",{"$f":"of:=INT(365.25*[Calcoli.Z179])","v":2459228},null,"D2",{"$f":"of:=INT(365.25*[Calcoli.AC179])","v":2459228},null,"D2",{"$f":"of:=INT(365.25*[Calcoli.AF179])","v":2459228},null,"D2",{"$f":"of:=INT(365.25*[Calcoli.AI179])","v":2459228},null,"D2",{"$f":"of:=INT(365.25*[Calcoli.AL179])","v":2459228},null,"D2",{"$f":"of:=INT(365.25*[Calcoli.AO179])","v":2459228}]
["E2",{"$f":"of:=INT(([Calcoli.B178]-[Calcoli.B180])/30.6001)","v":14},null,"E2",{"$f":"of:=INT(([Calcoli.E178]-[Calcoli.E180])/30.6001)","v":15},null,"E2",{"$f":"of:=INT(([Calcoli.H178]-[Calcoli.H180])/30.6001)","v":4},null,"E2",{"$f":"of:=INT(([Calcoli.K178]-[Calcoli.K180])/30.6001)","v":5},null,"E2",{"$f":"of:=INT(([Calcoli.N178]-[Calcoli.N180])/30.6001)","v":6},null,"E2",{"$f":"of:=INT(([Calcoli.Q178]-[Calcoli.Q180])/30.6001)","v":7},null,"E2",{"$f":"of:=INT(([Calcoli.T178]-[Calcoli.T180])/30.6001)","v":8},null,"E2",{"$f":"of:=INT(([Calcoli.W178]-[Calcoli.W180])/30.6001)","v":8},null,"E2",{"$f":"of:=INT(([Calcoli.Z178]-[Calcoli.Z180])/30.6001)","v":9},null,"E2",{"$f":"of:=INT(([Calcoli.AC178]-[Calcoli.AC180])/30.6001)","v":10},null,"E2",{"$f":"of:=INT(([Calcoli.AF178]-[Calcoli.AF180])/30.6001)","v":11},null,"E2",{"$f":"of:=INT(([Calcoli.AI178]-[Calcoli.AI180])/30.6001)","v":12},null,"E2",{"$f":"of:=INT(([Calcoli.AL178]-[Calcoli.AL180])/30.6001)","v":13},null,"E2",{"$f":"of:=INT(([Calcoli.AO178]-[Calcoli.AO180])/30.6001)","v":14}]
["Giorno_PQ",{"$f":"of:=ROUND([Calcoli.B178]-[Calcoli.B180]-INT(30.6001*[Calcoli.B181])+[Calcoli.B175];4)","v":5.8222},null,"Giorno_PQ",{"$f":"of:=ROUND([Calcoli.E178]-[Calcoli.E180]-INT(30.6001*[Calcoli.E181])+[Calcoli.E175];4)","v":4.1777},null,"Giorno_PQ",{"$f":"of:=ROUND([Calcoli.H178]-[Calcoli.H180]-INT(30.6001*[Calcoli.H181])+[Calcoli.H175];4)","v":5.4789},null,"Giorno_PQ",{"$f":"of:=ROUND([Calcoli.K178]-[Calcoli.K180]-INT(30.6001*[Calcoli.K181])+[Calcoli.K175];4)","v":3.7756},null,"Giorno_PQ",{"$f":"of:=ROUND([Calcoli.N178]-[Calcoli.N180]-INT(30.6001*[Calcoli.N181])+[Calcoli.N175];4)","v":3.1139},null,"Giorno_PQ",{"$f":"of:=ROUND([Calcoli.Q178]-[Calcoli.Q180]-INT(30.6001*[Calcoli.Q181])+[Calcoli.Q175];4)","v":1.5269},null,"Giorno_PQ",{"$f":"of:=ROUND([Calcoli.T178]-[Calcoli.T180]-INT(30.6001*[Calcoli.T181])+[Calcoli.T175];4)","v":1.0331},null,"Giorno_PQ",{"$f":"of:=ROUND([Calcoli.W178]-[Calcoli.W180]-INT(30.6001*[Calcoli.W181])+[Calcoli.W175];4)","v":30.6389},null,"Giorno_PQ",{"$f":"of:=ROUND([Calcoli.Z178]-[Calcoli.Z180]-INT(30.6001*[Calcoli.Z181])+[Calcoli.Z175];4)","v":29.3409},null,"Giorno_PQ",{"$f":"of:=ROUND([Calcoli.AC178]-[Calcoli.AC180]-INT(30.6001*[Calcoli.AC181])+[Calcoli.AC175];4)","v":28.1194},null,"Giorno_PQ",{"$f":"of:=ROUND([Calcoli.AF178]-[Calcoli.AF180]-INT(30.6001*[Calcoli.AF181])+[Calcoli.AF175];4)","v":27.9308},null,"Giorno_PQ",{"$f":"of:=ROUND([Calcoli.AI178]-[Calcoli.AI180]-INT(30.6001*[Calcoli.AI181])+[Calcoli.AI175];4)","v":26.7088},null,"Giorno_PQ",{"$f":"of:=ROUND([Calcoli.AL178]-[Calcoli.AL180]-INT(30.6001*[Calcoli.AL181])+[Calcoli.AL175];4)","v":26.3871},null,"Giorno_PQ",{"$f":"of:=ROUND([Calcoli.AO178]-[Calcoli.AO180]-INT(30.6001*[Calcoli.AO181])+[Calcoli.AO175];4)","v":24.9289}]
["Mese_PQ",{"$f":"of:=IF([Calcoli.B181]<13.5;[Calcoli.B181]-1;[Calcoli.B181]-13)","v":1},null,"Mese_PQ",{"$f":"of:=IF([Calcoli.E181]<13.5;[Calcoli.E181]-1;[Calcoli.E181]-13)","v":2},null,"Mese_PQ",{"$f":"of:=IF([Calcoli.H181]<13.5;[Calcoli.H181]-1;[Calcoli.H181]-13)","v":3},null,"Mese_PQ",{"$f":"of:=IF([Calcoli.K181]<13.5;[Calcoli.K181]-1;[Calcoli.K181]-13)","v":4},null,"Mese_PQ",{"$f":"of:=IF([Calcoli.N181]<13.5;[Calcoli.N181]-1;[Calcoli.N181]-13)","v":5},null,"Mese_PQ",{"$f":"of:=IF([Calcoli.Q181]<13.5;[Calcoli.Q181]-1;[Calcoli.Q181]-13)","v":6},null,"Mese_PQ",{"$f":"of:=IF([Calcoli.T181]<13.5;[Calcoli.T181]-1;[Calcoli.T181]-13)","v":7},null,"Mese_PQ",{"$f":"of:=IF([Calcoli.W181]<13.5;[Calcoli.W181]-1;[Calcoli.W181]-13)","v":7},null,"Mese_PQ",{"$f":"of:=IF([Calcoli.Z181]<13.5;[Calcoli.Z181]-1;[Calcoli.Z181]-13)","v":8},null,"Mese_PQ",{"$f":"of:=IF([Calcoli.AC181]<13.5;[Calcoli.AC181]-1;[Calcoli.AC181]-13)","v":9},null,"Mese_PQ",{"$f":"of:=IF([Calcoli.AF181]<13.5;[Calcoli.AF181]-1;[Calcoli.AF181]-13)","v":10},null,"Mese_PQ",{"$f":"of:=IF([Calcoli.AI181]<13.5;[Calcoli.AI181]-1;[Calcoli.AI181]-13)","v":11},null,"Mese_PQ",{"$f":"of:=IF([Calcoli.AL181]<13.5;[Calcoli.AL181]-1;[Calcoli.AL181]-13)","v":12},null,"Mese_PQ",{"$f":"of:=IF([Calcoli.AO181]<13.5;[Calcoli.AO181]-1;[Calcoli.AO181]-13)","v":1}]
["ANNO_PQ",{"$f":"of:=IF([Calcoli.B183]>2.5 AND([Calcoli.B183]<12.5);[Calcoli.B179]-4716;[Calcoli.B179]-4715)","v":2017},null,"ANNO_PQ",{"$f":"of:=IF([Calcoli.E183]>2.5 AND([Calcoli.E183]<12.5);[Calcoli.E179]-4716;[Calcoli.E179]-4715)","v":2017},null,"ANNO_PQ",{"$f":"of:=IF([Calcoli.H183]>2.5 AND([Calcoli.H183]<12.5);[Calcoli.H179]-4716;[Calcoli.H179]-4715)","v":2017},null,"ANNO_PQ",{"$f":"of:=IF([Calcoli.K183]>2.5 AND([Calcoli.K183]<12.5);[Calcoli.K179]-4716;[Calcoli.K179]-4715)","v":2017},null,"ANNO_PQ",{"$f":"of:=IF([Calcoli.N183]>2.5 AND([Calcoli.N183]<12.5);[Calcoli.N179]-4716;[Calcoli.N179]-4715)","v":2017},null,"ANNO_PQ",{"$f":"of:=IF([Calcoli.Q183]>2.5 AND([Calcoli.Q183]<12.5);[Calcoli.Q179]-4716;[Calcoli.Q179]-4715)","v":2017},null,"ANNO_PQ",{"$f":"of:=IF([Calcoli.T183]>2.5 AND([Calcoli.T183]<12.5);[Calcoli.T179]-4716;[Calcoli.T179]-4715)","v":2017},null,"ANNO_PQ",{"$f":"of:=IF([Calcoli.W183]>2.5 AND([Calcoli.W183]<12.5);[Calcoli.W179]-4716;[Calcoli.W179]-4715)","v":2017},null,"ANNO_PQ",{"$f":"of:=IF([Calcoli.Z183]>2.5 AND([Calcoli.Z183]<12.5);[Calcoli.Z179]-4716;[Calcoli.Z179]-4715)","v":2017},null,"ANNO_PQ",{"$f":"of:=IF([Calcoli.AC183]>2.5 AND([Calcoli.AC183]<12.5);[Calcoli.AC179]-4716;[Calcoli.AC179]-4715)","v":2017},null,"ANNO_PQ",{"$f":"of:=IF([Calcoli.AF183]>2.5 AND([Calcoli.AF183]<12.5);[Calcoli.AF179]-4716;[Calcoli.AF179]-4715)","v":2017},null,"ANNO_PQ",{"$f":"of:=IF([Calcoli.AI183]>2.5 AND([Calcoli.AI183]<12.5);[Calcoli.AI179]-4716;[Calcoli.AI179]-4715)","v":2017},null,"ANNO_PQ",{"$f":"of:=IF([Calcoli.AL183]>2.5 AND([Calcoli.AL183]<12.5);[Calcoli.AL179]-4716;[Calcoli.AL179]-4715)","v":2017},null,"ANNO_PQ",{"$f":"of:=IF([Calcoli.AO183]>2.5 AND([Calcoli.AO183]<12.5);[Calcoli.AO179]-4716;[Calcoli.AO179]-4715)","v":2018}]
["Data_GD PQ",{"$f":"of:=DATE([Calcoli.B184];[Calcoli.B183];[Calcoli.B182])","v":"2017-01-05"},null,"Data_GD PQ",{"$f":"of:=DATE([Calcoli.E184];[Calcoli.E183];[Calcoli.E182])","v":"2017-02-04"},null,"Data_GD PQ",{"$f":"of:=DATE([Calcoli.H184];[Calcoli.H183];[Calcoli.H182])","v":"2017-03-05"},null,"Data_GD PQ",{"$f":"of:=DATE([Calcoli.K184];[Calcoli.K183];[Calcoli.K182])","v":"2017-04-03"},null,"Data_GD PQ",{"$f":"of:=DATE([Calcoli.N184];[Calcoli.N183];[Calcoli.N182])","v":"2017-05-03"},null,"Data_GD PQ",{"$f":"of:=DATE([Calcoli.Q184];[Calcoli.Q183];[Calcoli.Q182])","v":"2017-06-01"},null,"Data_GD PQ",{"$f":"of:=DATE([Calcoli.T184];[Calcoli.T183];[Calcoli.T182])","v":"2017-07-01"},null,"Data_GD PQ",{"$f":"of:=DATE([Calcoli.W184];[Calcoli.W183];[Calcoli.W182])","v":"2017-07-30"},null,"Data_GD PQ",{"$f":"of:=DATE([Calcoli.Z184];[Calcoli.Z183];[Calcoli.Z182])","v":"2017-08-29"},null,"Data_GD PQ",{"$f":"of:=DATE([Calcoli.AC184];[Calcoli.AC183];[Calcoli.AC182])","v":"2017-09-28"},null,"Data_GD PQ",{"$f":"of:=DATE([Calcoli.AF184];[Calcoli.AF183];[Calcoli.AF182])","v":"2017-10-27"},null,"Data_GD PQ",{"$f":"of:=DATE([Calcoli.AI184];[Calcoli.AI183];[Calcoli.AI182])","v":"2017-11-26"},null,"Data_GD PQ",{"$f":"of:=DATE([Calcoli.AL184];[Calcoli.AL183];[Calcoli.AL182])","v":"2017-12-26"},null,"Data_GD PQ",{"$f":"of:=DATE([Calcoli.AO184];[Calcoli.AO183];[Calcoli.AO182])","v":"2018-01-24"}]
["Ore_GD PQ",{"$f":"of:=INT(([Calcoli.B182]-INT([Calcoli.B182]))*24)+1","v":20},null,"Ore_GD PQ",{"$f":"of:=INT(([Calcoli.E182]-INT([Calcoli.E182]))*24)+1","v":5},null,"Ore_GD PQ",{"$f":"of:=INT(([Calcoli.H182]-INT([Calcoli.H182]))*24)+1","v":12},null,"Ore_GD PQ",{"$f":"of:=INT(([Calcoli.K182]-INT([Calcoli.K182]))*24)+1","v":19},null,"Ore_GD PQ",{"$f":"of:=INT(([Calcoli.N182]-INT([Calcoli.N182]))*24)+1","v":3},null,"Ore_GD PQ",{"$f":"of:=INT(([Calcoli.Q182]-INT([Calcoli.Q182]))*24)+1","v":13},null,"Ore_GD PQ",{"$f":"of:=INT(([Calcoli.T182]-INT([Calcoli.T182]))*24)+1","v":1},null,"Ore_GD PQ",{"$f":"of:=INT(([Calcoli.W182]-INT([Calcoli.W182]))*24)+1","v":16},null,"Ore_GD PQ",{"$f":"of:=INT(([Calcoli.Z182]-INT([Calcoli.Z182]))*24)+1","v":9},null,"Ore_GD PQ",{"$f":"of:=INT(([Calcoli.AC182]-INT([Calcoli.AC182]))*24)+1","v":3},null,"Ore_GD PQ",{"$f":"of:=INT(([Calcoli.AF182]-INT([Calcoli.AF182]))*24)+1","v":23},null,"Ore_GD PQ",{"$f":"of:=INT(([Calcoli.AI182]-INT([Calcoli.AI182]))*24)+1","v":18},null,"Ore_GD PQ",{"$f":"of:=INT(([Calcoli.AL182]-INT([Calcoli.AL182]))*24)+1","v":10},null,"Ore_GD PQ",{"$f":"of:=INT(([Calcoli.AO182]-INT([Calcoli.AO182]))*24)+1","v":23}]
["Minuti_GD PQ",{"$f":"of:=INT((([Calcoli.B182]-INT([Calcoli.B182]))*24-([Calcoli.B186]-1))*60)","v":43},null,"Minuti_GD PQ",{"$f":"of:=INT((([Calcoli.E182]-INT([Calcoli.E182]))*24-([Calcoli.E186]-1))*60)","v":15},null,"Minuti_GD PQ",{"$f":"of:=INT((([Calcoli.H182]-INT([Calcoli.H182]))*24-([Calcoli.H186]-1))*60)","v":29},null,"Minuti_GD PQ",{"$f":"of:=INT((([Calcoli.K182]-INT([Calcoli.K182]))*24-([Calcoli.K186]-1))*60)","v":36},null,"Minuti_GD PQ",{"$f":"of:=INT((([Calcoli.N182]-INT([Calcoli.N182]))*24-([Calcoli.N186]-1))*60)","v":44},null,"Minuti_GD PQ",{"$f":"of:=INT((([Calcoli.Q182]-INT([Calcoli.Q182]))*24-([Calcoli.Q186]-1))*60)","v":38},null,"Minuti_GD PQ",{"$f":"of:=INT((([Calcoli.T182]-INT([Calcoli.T182]))*24-([Calcoli.T186]-1))*60)","v":47},null,"Minuti_GD PQ",{"$f":"of:=INT((([Calcoli.W182]-INT([Calcoli.W182]))*24-([Calcoli.W186]-1))*60)","v":20},null,"Minuti_GD PQ",{"$f":"of:=INT((([Calcoli.Z182]-INT([Calcoli.Z182]))*24-([Calcoli.Z186]-1))*60)","v":10},null,"Minuti_GD PQ",{"$f":"of:=INT((([Calcoli.AC182]-INT([Calcoli.AC182]))*24-([Calcoli.AC186]-1))*60)","v":51},null,"Minuti_GD PQ",{"$f":"of:=INT((([Calcoli.AF182]-INT([Calcoli.AF182]))*24-([Calcoli.AF186]-1))*60)","v":20},null,"Minuti_GD PQ",{"$f":"of:=INT((([Calcoli.AI182]-INT([Calcoli.AI182]))*24-([Calcoli.AI186]-1))*60)","v":0},null,"Minuti_GD PQ",{"$f":"of:=INT((([Calcoli.AL182]-INT([Calcoli.AL182]))*24-([Calcoli.AL186]-1))*60)","v":17},null,"Minuti_GD PQ",{"$f":"of:=INT((([Calcoli.AO182]-INT([Calcoli.AO182]))*24-([Calcoli.AO186]-1))*60)","v":17}]
["Secondi_GD PQ",{"$f":"of:=INT((((([Calcoli.B182]-INT([Calcoli.B182]))*24-([Calcoli.B186]-1))*60)-[Calcoli.B187])*60)","v":58},null,"Secondi_GD PQ",{"$f":"of:=INT((((([Calcoli.E182]-INT([Calcoli.E182]))*24-([Calcoli.E186]-1))*60)-[Calcoli.E187])*60)","v":53},null,"Secondi_GD PQ",{"$f":"of:=INT((((([Calcoli.H182]-INT([Calcoli.H182]))*24-([Calcoli.H186]-1))*60)-[Calcoli.H187])*60)","v":36},null,"Secondi_GD PQ",{"$f":"of:=INT((((([Calcoli.K182]-INT([Calcoli.K182]))*24-([Calcoli.K186]-1))*60)-[Calcoli.K187])*60)","v":51},null,"Secondi_GD PQ",{"$f":"of:=INT((((([Calcoli.N182]-INT([Calcoli.N182]))*24-([Calcoli.N186]-1))*60)-[Calcoli.N187])*60)","v":0},null,"Secondi_GD PQ",{"$f":"of:=INT((((([Calcoli.Q182]-INT([Calcoli.Q182]))*24-([Calcoli.Q186]-1))*60)-[Calcoli.Q187])*60)","v":44},null,"Secondi_GD PQ",{"$f":"of:=INT((((([Calcoli.T182]-INT([Calcoli.T182]))*24-([Calcoli.T186]-1))*60)-[Calcoli.T187])*60)","v":39},null,"Secondi_GD PQ",{"$f":"of:=INT((((([Calcoli.W182]-INT([Calcoli.W182]))*24-([Calcoli.W186]-1))*60)-[Calcoli.W187])*60)","v":0},null,"Secondi_GD PQ",{"$f":"of:=INT((((([Calcoli.Z182]-INT([Calcoli.Z182]))*24-([Calcoli.Z186]-1))*60)-[Calcoli.Z187])*60)","v":53},null,"Secondi_GD PQ",{"$f":"of:=INT((((([Calcoli.AC182]-INT([Calcoli.AC182]))*24-([Calcoli.AC186]-1))*60)-[Calcoli.AC187])*60)","v":56},null,"Secondi_GD PQ",{"$f":"of:=INT((((([Calcoli.AF182]-INT([Calcoli.AF182]))*24-([Calcoli.AF186]-1))*60)-[Calcoli.AF187])*60)","v":21},null,"Secondi_GD PQ",{"$f":"of:=INT((((([Calcoli.AI182]-INT([Calcoli.AI182]))*24-([Calcoli.AI186]-1))*60)-[Calcoli.AI187])*60)","v":40},null,"Secondi_GD PQ",{"$f":"of:=INT((((([Calcoli.AL182]-INT([Calcoli.AL182]))*24-([Calcoli.AL186]-1))*60)-[Calcoli.AL187])*60)","v":25},null,"Secondi_GD PQ",{"$f":"of:=INT((((([Calcoli.AO182]-INT([Calcoli.AO182]))*24-([Calcoli.AO186]-1))*60)-[Calcoli.AO187])*60)","v":36}]
["JD_Data LP",{"$f":"of:=[Calcoli.B148]","v":2457765.9828},null,"JD_Data LP",{"$f":"of:=[Calcoli.E148]","v":2457795.5237},null,"JD_Data LP",{"$f":"of:=[Calcoli.H148]","v":2457825.1215},null,"JD_Data LP",{"$f":"of:=[Calcoli.K148]","v":2457854.7566},null,"JD_Data LP",{"$f":"of:=[Calcoli.N148]","v":2457884.4057},null,"JD_Data LP",{"$f":"of:=[Calcoli.Q148]","v":2457914.0497},null,"JD_Data LP",{"$f":"of:=[Calcoli.T148]","v":2457943.6728},null,"JD_Data LP",{"$f":"of:=[Calcoli.W148]","v":2457973.2592},null,"JD_Data LP",{"$f":"of:=[Calcoli.Z148]","v":2458002.7954},null,"JD_Data LP",{"$f":"of:=[Calcoli.AC148]","v":2458032.2794},null,"JD_Data LP",{"$f":"of:=[Calcoli.AF148]","v":2458061.7257},null,"JD_Data LP",{"$f":"of:=[Calcoli.AI148]","v":2458091.1591},null,"JD_Data LP",{"$f":"of:=[Calcoli.AL148]","v":2458120.6015},null,"JD_Data LP",{"$f":"of:=[Calcoli.AO148]","v":2458150.0614}]
["Z3",{"$f":"of:=INT([Calcoli.B189]+0.5)","v":2457766},null,"Z3",{"$f":"of:=INT([Calcoli.E189]+0.5)","v":2457796},null,"Z3",{"$f":"of:=INT([Calcoli.H189]+0.5)","v":2457825},null,"Z3",{"$f":"of:=INT([Calcoli.K189]+0.5)","v":2457855},null,"Z3",{"$f":"of:=INT([Calcoli.N189]+0.5)","v":2457884},null,"Z3",{"$f":"of:=INT([Calcoli.Q189]+0.5)","v":2457914},null,"Z3",{"$f":"of:=INT([Calcoli.T189]+0.5)","v":2457944},null,"Z3",{"$f":"of:=INT([Calcoli.W189]+0.5)","v":2457973},null,"Z3",{"$f":"of:=INT([Calcoli.Z189]+0.5)","v":2458003},null,"Z3",{"$f":"of:=INT([Calcoli.AC189]+0.5)","v":2458032},null,"Z3",{"$f":"of:=INT([Calcoli.AF189]+0.5)","v":2458062},null,"Z3",{"$f":"of:=INT([Calcoli.AI189]+0.5)","v":2458091},null,"Z3",{"$f":"of:=INT([Calcoli.AL189]+0.5)","v":2458121},null,"Z3",{"$f":"of:=INT([Calcoli.AO189]+0.5)","v":2458150}]
["F3",{"$f":"of:=[Calcoli.B189]+0.5-INT([Calcoli.B189]+0.5)","v":0.482799999881536},null,"F3",{"$f":"of:=[Calcoli.E189]+0.5-INT([Calcoli.E189]+0.5)","v":0.0236999997869134},null,"F3",{"$f":"of:=[Calcoli.H189]+0.5-INT([Calcoli.H189]+0.5)","v":0.621499999891967},null,"F3",{"$f":"of:=[Calcoli.K189]+0.5-INT([Calcoli.K189]+0.5)","v":0.256599999964237},null,"F3",{"$f":"of:=[Calcoli.N189]+0.5-INT([Calcoli.N189]+0.5)","v":0.90570000000298},null,"F3",{"$f":"of:=[Calcoli.Q189]+0.5-INT([Calcoli.Q189]+0.5)","v":0.549699999857694},null,"F3",{"$f":"of:=[Calcoli.T189]+0.5-INT([Calcoli.T189]+0.5)","v":0.172799999825656},null,"F3",{"$f":"of:=[Calcoli.W189]+0.5-INT([Calcoli.W189]+0.5)","v":0.759200000204146},null,"F3",{"$f":"of:=[Calcoli.Z189]+0.5-INT([Calcoli.Z189]+0.5)","v":0.295400000177324},null,"F3",{"$f":"of:=[Calcoli.AC189]+0.5-INT([Calcoli.AC189]+0.5)","v":0.779399999883026},null,"F3",{"$f":"of:=[Calcoli.AF189]+0.5-INT([Calcoli.AF189]+0.5)","v":0.225699999835342},null,"F3",{"$f":"of:=[Calcoli.AI189]+0.5-INT([Calcoli.AI189]+0.5)","v":0.659099999815226},null,"F3",{"$f":"of:=[Calcoli.AL189]+0.5-INT([Calcoli.AL189]+0.5)","v":0.10149999987334},null,"F3",{"$f":"of:=[Calcoli.AO189]+0.5-INT([Calcoli.AO189]+0.5)","v":0.56140000000596}]
["Ω3",{"$f":"of:=INT(([Calcoli.B190]-1867216.25)/36524.25)","v":16},null,"Ω3",{"$f":"of:=INT(([Calcoli.E190]-1867216.25)/36524.25)","v":16},null,"Ω3",{"$f":"of:=INT(([Calcoli.H190]-1867216.25)/36524.25)","v":16},null,"Ω3",{"$f":"of:=INT(([Calcoli.K190]-1867216.25)/36524.25)","v":16},null,"Ω3",{"$f":"of:=INT(([Calcoli.N190]-1867216.25)/36524.25)","v":16},null,"Ω3",{"$f":"of:=INT(([Calcoli.Q190]-1867216.25)/36524.25)","v":16},null,"Ω3",{"$f":"of:=INT(([Calcoli.T190]-1867216.25)/36524.25)","v":16},null,"Ω3",{"$f":"of:=INT(([Calcoli.W190]-1867216.25)/36524.25)","v":16},null,"Ω3",{"$f":"of:=INT(([Calcoli.Z190]-1867216.25)/36524.25)","v":16},null,"Ω3",{"$f":"of:=INT(([Calcoli.AC190]-1867216.25)/36524.25)","v":16},null,"Ω3",{"$f":"of:=INT(([Calcoli.AF190]-1867216.25)/36524.25)","v":16},null,"Ω3",{"$f":"of:=INT(([Calcoli.AI190]-1867216.25)/36524.25)","v":16},null,"Ω3",{"$f":"of:=INT(([Calcoli.AL190]-1867216.25)/36524.25)","v":16},null,"Ω3",{"$f":"of:=INT(([Calcoli.AO190]-1867216.25)/36524.25)","v":16}]
["A3",{"$f":"of:=IF([Calcoli.B190]<2299161;[Calcoli.B190];[Calcoli.B190]+1+[Calcoli.B192]-INT([Calcoli.B192]/4))","v":2457779},null,"A3",{"$f":"of:=IF([Calcoli.E190]<2299161;[Calcoli.E190];[Calcoli.E190]+1+[Calcoli.E192]-INT([Calcoli.E192]/4))","v":2457809},null,"A3",{"$f":"of:=IF([Calcoli.H190]<2299161;[Calcoli.H190];[Calcoli.H190]+1+[Calcoli.H192]-INT([Calcoli.H192]/4))","v":2457838},null,"A3",{"$f":"of:=IF([Calcoli.K190]<2299161;[Calcoli.K190];[Calcoli.K190]+1+[Calcoli.K192]-INT([Calcoli.K192]/4))","v":2457868},null,"A3",{"$f":"of:=IF([Calcoli.N190]<2299161;[Calcoli.N190];[Calcoli.N190]+1+[Calcoli.N192]-INT([Calcoli.N192]/4))","v":2457897},null,"A3",{"$f":"of:=IF([Calcoli.Q190]<2299161;[Calcoli.Q190];[Calcoli.Q190]+1+[Calcoli.Q192]-INT([Calcoli.Q192]/4))","v":2457927},null,"A3",{"$f":"of:=IF([Calcoli.T190]<2299161;[Calcoli.T190];[Calcoli.T190]+1+[Calcoli.T192]-INT([Calcoli.T192]/4))","v":2457957},null,"A3",{"$f":"of:=IF([Calcoli.W190]<2299161;[Calcoli.W190];[Calcoli.W190]+1+[Calcoli.W192]-INT([Calcoli.W192]/4))","v":2457986},null,"A3",{"$f":"of:=IF([Calcoli.Z190]<2299161;[Calcoli.Z190];[Calcoli.Z190]+1+[Calcoli.Z192]-INT([Calcoli.Z192]/4))","v":2458016},null,"A3",{"$f":"of:=IF([Calcoli.AC190]<2299161;[Calcoli.AC190];[Calcoli.AC190]+1+[Calcoli.AC192]-INT([Calcoli.AC192]/4))","v":2458045},null,"A3",{"$f":"of:=IF([Calcoli.AF190]<2299161;[Calcoli.AF190];[Calcoli.AF190]+1+[Calcoli.AF192]-INT([Calcoli.AF192]/4))","v":2458075},null,"A3",{"$f":"of:=IF([Calcoli.AI190]<2299161;[Calcoli.AI190];[Calcoli.AI190]+1+[Calcoli.AI192]-INT([Calcoli.AI192]/4))","v":2458104},null,"A3",{"$f":"of:=IF([Calcoli.AL190]<2299161;[Calcoli.AL190];[Calcoli.AL190]+1+[Calcoli.AL192]-INT([Calcoli.AL192]/4))","v":2458134},null,"A3",{"$f":"of:=IF([Calcoli.AO190]<2299161;[Calcoli.AO190];[Calcoli.AO190]+1+[Calcoli.AO192]-INT([Calcoli.AO192]/4))","v":2458163}]
["B3",{"$f":"of:=[Calcoli.B193]+1524","v":2459303},null,"B3",{"$f":"of:=[Calcoli.E193]+1524","v":2459333},null,"B3",{"$f":"of:=[Calcoli.H193]+1524","v":2459362},null,"B3",{"$f":"of:=[Calcoli.K193]+1524","v":2459392},null,"B3",{"$f":"of:=[Calcoli.N193]+1524","v":2459421},null,"B3",{"$f":"of:=[Calcoli.Q193]+1524","v":2459451},null,"B3",{"$f":"of:=[Calcoli.T193]+1524","v":2459481},null,"B3",{"$f":"of:=[Calcoli.W193]+1524","v":2459510},null,"B3",{"$f":"of:=[Calcoli.Z193]+1524","v":2459540},null,"B3",{"$f":"of:=[Calcoli.AC193]+1524","v":2459569},null,"B3",{"$f":"of:=[Calcoli.AF193]+1524","v":2459599},null,"B3",{"$f":"of:=[Calcoli.AI193]+1524","v":2459628},null,"B3",{"$f":"of:=[Calcoli.AL193]+1524","v":2459658},null,"B3",{"$f":"of:=[Calcoli.AO193]+1524","v":2459687}]
["C3",{"$f":"of:=INT(([Calcoli.B194]-122.1)/365.25)","v":6732},null,"C3",{"$f":"of:=INT(([Calcoli.E194]-122.1)/365.25)","v":6732},null,"C3",{"$f":"of:=INT(([Calcoli.H194]-122.1)/365.25)","v":6733},null,"C3",{"$f":"of:=INT(([Calcoli.K194]-122.1)/365.25)","v":6733},null,"C3",{"$f":"of:=INT(([Calcoli.N194]-122.1)/365.25)","v":6733},null,"C3",{"$f":"of:=INT(([Calcoli.Q194]-122.1)/365.25)","v":6733},null,"C3",{"$f":"of:=INT(([Calcoli.T194]-122.1)/365.25)","v":6733},null,"C3",{"$f":"of:=INT(([Calcoli.W194]-122.1)/365.25)","v":6733},null,"C3",{"$f":"of:=INT(([Calcoli.Z194]-122.1)/365.25)","v":6733},null,"C3",{"$f":"of:=INT(([Calcoli.AC194]-122.1)/365.25)","v":6733},null,"C3",{"$f":"of:=INT(([Calcoli.AF194]-122.1)/365.25)","v":6733},null,"C3",{"$f":"of:=INT(([Calcoli.AI194]-122.1)/365.25)","v":6733},null,"C3",{"$f":"of:=INT(([Calcoli.AL194]-122.1)/365.25)","v":6733},null,"C3",{"$f":"of:=INT(([Calcoli.AO194]-122.1)/365.25)","v":6733}]
["D3",{"$f":"of:=INT(365.25*[Calcoli.B195])","v":2458863},null,"D3",{"$f":"of:=INT(365.25*[Calcoli.E195])","v":2458863},null,"D3",{"$f":"of:=INT(365.25*[Calcoli.H195])","v":2459228},null,"D3",{"$f":"of:=INT(365.25*[Calcoli.K195])","v":2459228},null,"D3",{"$f":"of:=INT(365.25*[Calcoli.N195])","v":2459228},null,"D3",{"$f":"of:=INT(365.25*[Calcoli.Q195])","v":2459228},null,"D3",{"$f":"of:=INT(365.25*[Calcoli.T195])","v":2459228},null,"D3",{"$f":"of:=INT(365.25*[Calcoli.W195])","v":2459228},null,"D3",{"$f":"of:=INT(365.25*[Calcoli.Z195])","v":2459228},null,"D3",{"$f":"of:=INT(365.25*[Calcoli.AC195])","v":2459228},null,"D3",{"$f":"of:=INT(365.25*[Calcoli.AF195])","v":2459228},null,"D3",{"$f":"of:=INT(365.25*[Calcoli.AI195])","v":2459228},null,"D3",{"$f":"of:=INT(365.25*[Calcoli.AL195])","v":2459228},null,"D3",{"$f":"of:=INT(365.25*[Calcoli.AO195])","v":2459228}]
["E3",{"$f":"of:=INT(([Calcoli.B194]-[Calcoli.B196])/30.6001)","v":14},null,"E3",{"$f":"of:=INT(([Calcoli.E194]-[Calcoli.E196])/30.6001)","v":15},null,"E3",{"$f":"of:=INT(([Calcoli.H194]-[Calcoli.H196])/30.6001)","v":4},null,"E3",{"$f":"of:=INT(([Calcoli.K194]-[Calcoli.K196])/30.6001)","v":5},null,"E3",{"$f":"of:=INT(([Calcoli.N194]-[Calcoli.N196])/30.6001)","v":6},null,"E3",{"$f":"of:=INT(([Calcoli.Q194]-[Calcoli.Q196])/30.6001)","v":7},null,"E3",{"$f":"of:=INT(([Calcoli.T194]-[Calcoli.T196])/30.6001)","v":8},null,"E3",{"$f":"of:=INT(([Calcoli.W194]-[Calcoli.W196])/30.6001)","v":9},null,"E3",{"$f":"of:=INT(([Calcoli.Z194]-[Calcoli.Z196])/30.6001)","v":10},null,"E3",{"$f":"of:=INT(([Calcoli.AC194]-[Calcoli.AC196])/30.6001)","v":11},null,"E3",{"$f":"of:=INT(([Calcoli.AF194]-[Calcoli.AF196])/30.6001)","v":12},null,"E3",{"$f":"of:=INT(([Calcoli.AI194]-[Calcoli.AI196])/30.6001)","v":13},null,"E3",{"$f":"of:=INT(([Calcoli.AL194]-[Calcoli.AL196])/30.6001)","v":14},null,"E3",{"$f":"of:=INT(([Calcoli.AO194]-[Calcoli.AO196])/30.6001)","v":14}]
["Giorno_LP",{"$f":"of:=ROUND([Calcoli.B194]-[Calcoli.B196]-INT(30.6001*[Calcoli.B197])+[Calcoli.B191];4)","v":12.4828},null,"Giorno_LP",{"$f":"of:=ROUND([Calcoli.E194]-[Calcoli.E196]-INT(30.6001*[Calcoli.E197])+[Calcoli.E191];4)","v":11.0237},null,"Giorno_LP",{"$f":"of:=ROUND([Calcoli.H194]-[Calcoli.H196]-INT(30.6001*[Calcoli.H197])+[Calcoli.H191];4)","v":12.6215},null,"Giorno_LP",{"$f":"of:=ROUND([Calcoli.K194]-[Calcoli.K196]-INT(30.6001*[Calcoli.K197])+[Calcoli.K191];4)","v":11.2566},null,"Giorno_LP",{"$f":"of:=ROUND([Calcoli.N194]-[Calcoli.N196]-INT(30.6001*[Calcoli.N197])+[Calcoli.N191];4)","v":10.9057},null,"Giorno_LP",{"$f":"of:=ROUND([Calcoli.Q194]-[Calcoli.Q196]-INT(30.6001*[Calcoli.Q197])+[Calcoli.Q191];4)","v":9.5497},null,"Giorno_LP",{"$f":"of:=ROUND([Calcoli.T194]-[Calcoli.T196]-INT(30.6001*[Calcoli.T197])+[Calcoli.T191];4)","v":9.1728},null,"Giorno_LP",{"$f":"of:=ROUND([Calcoli.W194]-[Calcoli.W196]-INT(30.6001*[Calcoli.W197])+[Calcoli.W191];4)","v":7.7592},null,"Giorno_LP",{"$f":"of:=ROUND([Calcoli.Z194]-[Calcoli.Z196]-INT(30.6001*[Calcoli.Z197])+[Calcoli.Z191];4)","v":6.2954},null,"Giorno_LP",{"$f":"of:=ROUND([Calcoli.AC194]-[Calcoli.AC196]-INT(30.6001*[Calcoli.AC197])+[Calcoli.AC191];4)","v":5.7794},null,"Giorno_LP",{"$f":"of:=ROUND([Calcoli.AF194]-[Calcoli.AF196]-INT(30.6001*[Calcoli.AF197])+[Calcoli.AF191];4)","v":4.2257},null,"Giorno_LP",{"$f":"of:=ROUND([Calcoli.AI194]-[Calcoli.AI196]-INT(30.6001*[Calcoli.AI197])+[Calcoli.AI191];4)","v":3.6591},null,"Giorno_LP",{"$f":"of:=ROUND([Calcoli.AL194]-[Calcoli.AL196]-INT(30.6001*[Calcoli.AL197])+[Calcoli.AL191];4)","v":2.1015},null,"Giorno_LP",{"$f":"of:=ROUND([Calcoli.AO194]-[Calcoli.AO196]-INT(30.6001*[Calcoli.AO197])+[Calcoli.AO191];4)","v":31.5614}]
["Mese_LP",{"$f":"of:=IF([Calcoli.B197]<13.5;[Calcoli.B197]-1;[Calcoli.B197]-13)","v":1},null,"Mese_LP",{"$f":"of:=IF([Calcoli.E197]<13.5;[Calcoli.E197]-1;[Calcoli.E197]-13)","v":2},null,"Mese_LP",{"$f":"of:=IF([Calcoli.H197]<13.5;[Calcoli.H197]-1;[Calcoli.H197]-13)","v":3},null,"Mese_LP",{"$f":"of:=IF([Calcoli.K197]<13.5;[Calcoli.K197]-1;[Calcoli.K197]-13)","v":4},null,"Mese_LP",{"$f":"of:=IF([Calcoli.N197]<13.5;[Calcoli.N197]-1;[Calcoli.N197]-13)","v":5},null,"Mese_LP",{"$f":"of:=IF([Calcoli.Q197]<13.5;[Calcoli.Q197]-1;[Calcoli.Q197]-13)","v":6},null,"Mese_LP",{"$f":"of:=IF([Calcoli.T197]<13.5;[Calcoli.T197]-1;[Calcoli.T197]-13)","v":7},null,"Mese_LP",{"$f":"of:=IF([Calcoli.W197]<13.5;[Calcoli.W197]-1;[Calcoli.W197]-13)","v":8},null,"Mese_LP",{"$f":"of:=IF([Calcoli.Z197]<13.5;[Calcoli.Z197]-1;[Calcoli.Z197]-13)","v":9},null,"Mese_LP",{"$f":"of:=IF([Calcoli.AC197]<13.5;[Calcoli.AC197]-1;[Calcoli.AC197]-13)","v":10},null,"Mese_LP",{"$f":"of:=IF([Calcoli.AF197]<13.5;[Calcoli.AF197]-1;[Calcoli.AF197]-13)","v":11},null,"Mese_LP",{"$f":"of:=IF([Calcoli.AI197]<13.5;[Calcoli.AI197]-1;[Calcoli.AI197]-13)","v":12},null,"Mese_LP",{"$f":"of:=IF([Calcoli.AL197]<13.5;[Calcoli.AL197]-1;[Calcoli.AL197]-13)","v":1},null,"Mese_LP",{"$f":"of:=IF([Calcoli.AO197]<13.5;[Calcoli.AO197]-1;[Calcoli.AO197]-13)","v":1}]
["ANNO_LP",{"$f":"of:=IF([Calcoli.B199]>2.5 AND([Calcoli.B199]<12.5);[Calcoli.B195]-4716;[Calcoli.B195]-4715)","v":2017},null,"ANNO_LP",{"$f":"of:=IF([Calcoli.E199]>2.5 AND([Calcoli.E199]<12.5);[Calcoli.E195]-4716;[Calcoli.E195]-4715)","v":2017},null,"ANNO_LP",{"$f":"of:=IF([Calcoli.H199]>2.5 AND([Calcoli.H199]<12.5);[Calcoli.H195]-4716;[Calcoli.H195]-4715)","v":2017},null,"ANNO_LP",{"$f":"of:=IF([Calcoli.K199]>2.5 AND([Calcoli.K199]<12.5);[Calcoli.K195]-4716;[Calcoli.K195]-4715)","v":2017},null,"ANNO_LP",{"$f":"of:=IF([Calcoli.N199]>2.5 AND([Calcoli.N199]<12.5);[Calcoli.N195]-4716;[Calcoli.N195]-4715)","v":2017},null,"ANNO_LP",{"$f":"of:=IF([Calcoli.Q199]>2.5 AND([Calcoli.Q199]<12.5);[Calcoli.Q195]-4716;[Calcoli.Q195]-4715)","v":2017},null,"ANNO_LP",{"$f":"of:=IF([Calcoli.T199]>2.5 AND([Calcoli.T199]<12.5);[Calcoli.T195]-4716;[Calcoli.T195]-4715)","v":2017},null,"ANNO_LP",{"$f":"of:=IF([Calcoli.W199]>2.5 AND([Calcoli.W199]<12.5);[Calcoli.W195]-4716;[Calcoli.W195]-4715)","v":2017},null,"ANNO_LP",{"$f":"of:=IF([Calcoli.Z199]>2.5 AND([Calcoli.Z199]<12.5);[Calcoli.Z195]-4716;[Calcoli.Z195]-4715)","v":2017},null,"ANNO_LP",{"$f":"of:=IF([Calcoli.AC199]>2.5 AND([Calcoli.AC199]<12.5);[Calcoli.AC195]-4716;[Calcoli.AC195]-4715)","v":2017},null,"ANNO_LP",{"$f":"of:=IF([Calcoli.AF199]>2.5 AND([Calcoli.AF199]<12.5);[Calcoli.AF195]-4716;[Calcoli.AF195]-4715)","v":2017},null,"ANNO_LP",{"$f":"of:=IF([Calcoli.AI199]>2.5 AND([Calcoli.AI199]<12.5);[Calcoli.AI195]-4716;[Calcoli.AI195]-4715)","v":2017},null,"ANNO_LP",{"$f":"of:=IF([Calcoli.AL199]>2.5 AND([Calcoli.AL199]<12.5);[Calcoli.AL195]-4716;[Calcoli.AL195]-4715)","v":2018},null,"ANNO_LP",{"$f":"of:=IF([Calcoli.AO199]>2.5 AND([Calcoli.AO199]<12.5);[Calcoli.AO195]-4716;[Calcoli.AO195]-4715)","v":2018}]
["Data_GD LP",{"$f":"of:=DATE([Calcoli.B200];[Calcoli.B199];[Calcoli.B198])","v":"2017-01-12"},null,"Data_GD LP",{"$f":"of:=DATE([Calcoli.E200];[Calcoli.E199];[Calcoli.E198])","v":"2017-02-11"},null,"Data_GD LP",{"$f":"of:=DATE([Calcoli.H200];[Calcoli.H199];[Calcoli.H198])","v":"2017-03-12"},null,"Data_GD LP",{"$f":"of:=DATE([Calcoli.K200];[Calcoli.K199];[Calcoli.K198])","v":"2017-04-11"},null,"Data_GD LP",{"$f":"of:=DATE([Calcoli.N200];[Calcoli.N199];[Calcoli.N198])","v":"2017-05-10"},null,"Data_GD LP",{"$f":"of:=DATE([Calcoli.Q200];[Calcoli.Q199];[Calcoli.Q198])","v":"2017-06-09"},null,"Data_GD LP",{"$f":"of:=DATE([Calcoli.T200];[Calcoli.T199];[Calcoli.T198])","v":"2017-07-09"},null,"Data_GD LP",{"$f":"of:=DATE([Calcoli.W200];[Calcoli.W199];[Calcoli.W198])","v":"2017-08-07"},null,"Data_GD LP",{"$f":"of:=DATE([Calcoli.Z200];[Calcoli.Z199];[Calcoli.Z198])","v":"2017-09-06"},null,"Data_GD LP",{"$f":"of:=DATE([Calcoli.AC200];[Calcoli.AC199];[Calcoli.AC198])","v":"2017-10-05"},null,"Data_GD LP",{"$f":"of:=DATE([Calcoli.AF200];[Calcoli.AF199];[Calcoli.AF198])","v":"2017-11-04"},null,"Data_GD LP",{"$f":"of:=DATE([Calcoli.AI200];[Calcoli.AI199];[Calcoli.AI198])","v":"2017-12-03"},null,"Data_GD LP",{"$f":"of:=DATE([Calcoli.AL200];[Calcoli.AL199];[Calcoli.AL198])","v":"2018-01-02"},null,"Data_GD LP",{"$f":"of:=DATE([Calcoli.AO200];[Calcoli.AO199];[Calcoli.AO198])","v":"2018-01-31"}]
["Ore_GD LP",{"$f":"of:=INT(([Calcoli.B198]-INT([Calcoli.B198]))*24)+1","v":12},null,"Ore_GD LP",{"$f":"of:=INT(([Calcoli.E198]-INT([Calcoli.E198]))*24)+1","v":1},null,"Ore_GD LP",{"$f":"of:=INT(([Calcoli.H198]-INT([Calcoli.H198]))*24)+1","v":15},null,"Ore_GD LP",{"$f":"of:=INT(([Calcoli.K198]-INT([Calcoli.K198]))*24)+1","v":7},null,"Ore_GD LP",{"$f":"of:=INT(([Calcoli.N198]-INT([Calcoli.N198]))*24)+1","v":22},null,"Ore_GD LP",{"$f":"of:=INT(([Calcoli.Q198]-INT([Calcoli.Q198]))*24)+1","v":14},null,"Ore_GD LP",{"$f":"of:=INT(([Calcoli.T198]-INT([Calcoli.T198]))*24)+1","v":5},null,"Ore_GD LP",{"$f":"of:=INT(([Calcoli.W198]-INT([Calcoli.W198]))*24)+1","v":19},null,"Ore_GD LP",{"$f":"of:=INT(([Calcoli.Z198]-INT([Calcoli.Z198]))*24)+1","v":8},null,"Ore_GD LP",{"$f":"of:=INT(([Calcoli.AC198]-INT([Calcoli.AC198]))*24)+1","v":19},null,"Ore_GD LP",{"$f":"of:=INT(([Calcoli.AF198]-INT([Calcoli.AF198]))*24)+1","v":6},null,"Ore_GD LP",{"$f":"of:=INT(([Calcoli.AI198]-INT([Calcoli.AI198]))*24)+1","v":16},null,"Ore_GD LP",{"$f":"of:=INT(([Calcoli.AL198]-INT([Calcoli.AL198]))*24)+1","v":3},null,"Ore_GD LP",{"$f":"of:=INT(([Calcoli.AO198]-INT([Calcoli.AO198]))*24)+1","v":14}]
["Minuti_GD LP",{"$f":"of:=INT((([Calcoli.B198]-INT([Calcoli.B198]))*24-([Calcoli.B202]-1))*60)","v":35},null,"Minuti_GD LP",{"$f":"of:=INT((([Calcoli.E198]-INT([Calcoli.E198]))*24-([Calcoli.E202]-1))*60)","v":34},null,"Minuti_GD LP",{"$f":"of:=INT((([Calcoli.H198]-INT([Calcoli.H198]))*24-([Calcoli.H202]-1))*60)","v":54},null,"Minuti_GD LP",{"$f":"of:=INT((([Calcoli.K198]-INT([Calcoli.K198]))*24-([Calcoli.K202]-1))*60)","v":9},null,"Minuti_GD LP",{"$f":"of:=INT((([Calcoli.N198]-INT([Calcoli.N198]))*24-([Calcoli.N202]-1))*60)","v":44},null,"Minuti_GD LP",{"$f":"of:=INT((([Calcoli.Q198]-INT([Calcoli.Q198]))*24-([Calcoli.Q202]-1))*60)","v":11},null,"Minuti_GD LP",{"$f":"of:=INT((([Calcoli.T198]-INT([Calcoli.T198]))*24-([Calcoli.T202]-1))*60)","v":8},null,"Minuti_GD LP",{"$f":"of:=INT((([Calcoli.W198]-INT([Calcoli.W198]))*24-([Calcoli.W202]-1))*60)","v":13},null,"Minuti_GD LP",{"$f":"of:=INT((([Calcoli.Z198]-INT([Calcoli.Z198]))*24-([Calcoli.Z202]-1))*60)","v":5},null,"Minuti_GD LP",{"$f":"of:=INT((([Calcoli.AC198]-INT([Calcoli.AC198]))*24-([Calcoli.AC202]-1))*60)","v":42},null,"Minuti_GD LP",{"$f":"of:=INT((([Calcoli.AF198]-INT([Calcoli.AF198]))*24-([Calcoli.AF202]-1))*60)","v":25},null,"Minuti_GD LP",{"$f":"of:=INT((([Calcoli.AI198]-INT([Calcoli.AI198]))*24-([Calcoli.AI202]-1))*60)","v":49},null,"Minuti_GD LP",{"$f":"of:=INT((([Calcoli.AL198]-INT([Calcoli.AL198]))*24-([Calcoli.AL202]-1))*60)","v":26},null,"Minuti_GD LP",{"$f":"of:=INT((([Calcoli.AO198]-INT([Calcoli.AO198]))*24-([Calcoli.AO202]-1))*60)","v":28}]
["Secondi_GD LP",{"$f":"of:=INT((((([Calcoli.B198]-INT([Calcoli.B198]))*24-([Calcoli.B202]-1))*60)-[Calcoli.B203])*60)","v":13},null,"Secondi_GD LP",{"$f":"of:=INT((((([Calcoli.E198]-INT([Calcoli.E198]))*24-([Calcoli.E202]-1))*60)-[Calcoli.E203])*60)","v":7},null,"Secondi_GD LP",{"$f":"of:=INT((((([Calcoli.H198]-INT([Calcoli.H198]))*24-([Calcoli.H202]-1))*60)-[Calcoli.H203])*60)","v":57},null,"Secondi_GD LP",{"$f":"of:=INT((((([Calcoli.K198]-INT([Calcoli.K198]))*24-([Calcoli.K202]-1))*60)-[Calcoli.K203])*60)","v":30},null,"Secondi_GD LP",{"$f":"of:=INT((((([Calcoli.N198]-INT([Calcoli.N198]))*24-([Calcoli.N202]-1))*60)-[Calcoli.N203])*60)","v":12},null,"Secondi_GD LP",{"$f":"of:=INT((((([Calcoli.Q198]-INT([Calcoli.Q198]))*24-([Calcoli.Q202]-1))*60)-[Calcoli.Q203])*60)","v":34},null,"Secondi_GD LP",{"$f":"of:=INT((((([Calcoli.T198]-INT([Calcoli.T198]))*24-([Calcoli.T202]-1))*60)-[Calcoli.T203])*60)","v":49},null,"Secondi_GD LP",{"$f":"of:=INT((((([Calcoli.W198]-INT([Calcoli.W198]))*24-([Calcoli.W202]-1))*60)-[Calcoli.W203])*60)","v":14},null,"Secondi_GD LP",{"$f":"of:=INT((((([Calcoli.Z198]-INT([Calcoli.Z198]))*24-([Calcoli.Z202]-1))*60)-[Calcoli.Z203])*60)","v":22},null,"Secondi_GD LP",{"$f":"of:=INT((((([Calcoli.AC198]-INT([Calcoli.AC198]))*24-([Calcoli.AC202]-1))*60)-[Calcoli.AC203])*60)","v":20},null,"Secondi_GD LP",{"$f":"of:=INT((((([Calcoli.AF198]-INT([Calcoli.AF198]))*24-([Calcoli.AF202]-1))*60)-[Calcoli.AF203])*60)","v":0},null,"Secondi_GD LP",{"$f":"of:=INT((((([Calcoli.AI198]-INT([Calcoli.AI198]))*24-([Calcoli.AI202]-1))*60)-[Calcoli.AI203])*60)","v":6},null,"Secondi_GD LP",{"$f":"of:=INT((((([Calcoli.AL198]-INT([Calcoli.AL198]))*24-([Calcoli.AL202]-1))*60)-[Calcoli.AL203])*60)","v":9},null,"Secondi_GD LP",{"$f":"of:=INT((((([Calcoli.AO198]-INT([Calcoli.AO198]))*24-([Calcoli.AO202]-1))*60)-[Calcoli.AO203])*60)","v":24}]
["JD_Data UQ",{"$f":"of:=[Calcoli.B149]","v":2457773.4288},null,"JD_Data UQ",{"$f":"of:=[Calcoli.E149]","v":2457803.3184},null,"JD_Data UQ",{"$f":"of:=[Calcoli.H149]","v":2457833.1702},null,"JD_Data UQ",{"$f":"of:=[Calcoli.K149]","v":2457862.9196},null,"JD_Data UQ",{"$f":"of:=[Calcoli.N149]","v":2457892.5279},null,"JD_Data UQ",{"$f":"of:=[Calcoli.Q149]","v":2457921.9861},null,"JD_Data UQ",{"$f":"of:=[Calcoli.T149]","v":2457951.3144},null,"JD_Data UQ",{"$f":"of:=[Calcoli.W149]","v":2457980.5571},null,"JD_Data UQ",{"$f":"of:=[Calcoli.Z149]","v":2458009.7721},null,"JD_Data UQ",{"$f":"of:=[Calcoli.AC149]","v":2458039.0223},null,"JD_Data UQ",{"$f":"of:=[Calcoli.AF149]","v":2458068.3631},null,"JD_Data UQ",{"$f":"of:=[Calcoli.AI149]","v":2458097.8314},null,"JD_Data UQ",{"$f":"of:=[Calcoli.AL149]","v":2458127.4378},null,"JD_Data UQ",{"$f":"of:=[Calcoli.AO149]","v":2458157.1665}]
["Z4",{"$f":"of:=INT([Calcoli.B205]+0.5)","v":2457773},null,"Z4",{"$f":"of:=INT([Calcoli.E205]+0.5)","v":2457803},null,"Z4",{"$f":"of:=INT([Calcoli.H205]+0.5)","v":2457833},null,"Z4",{"$f":"of:=INT([Calcoli.K205]+0.5)","v":2457863},null,"Z4",{"$f":"of:=INT([Calcoli.N205]+0.5)","v":2457893},null,"Z4",{"$f":"of:=INT([Calcoli.Q205]+0.5)","v":2457922},null,"Z4",{"$f":"of:=INT([Calcoli.T205]+0.5)","v":2457951},null,"Z4",{"$f":"of:=INT([Calcoli.W205]+0.5)","v":2457981},null,"Z4",{"$f":"of:=INT([Calcoli.Z205]+0.5)","v":2458010},null,"Z4",{"$f":"of:=INT([Calcoli.AC205]+0.5)","v":2458039},null,"Z4",{"$f":"of:=INT([Calcoli.AF205]+0.5)","v":2458068},null,"Z4",{"$f":"of:=INT([Calcoli.AI205]+0.5)","v":2458098},null,"Z4",{"$f":"of:=INT([Calcoli.AL205]+0.5)","v":2458127},null,"Z4",{"$f":"of:=INT([Calcoli.AO205]+0.5)","v":2458157}]
["F4",{"$f":"of:=[Calcoli.B205]+0.5-INT([Calcoli.B205]+0.5)","v":0.928799999877811},null,"F4",{"$f":"of:=[Calcoli.E205]+0.5-INT([Calcoli.E205]+0.5)","v":0.818400000222027},null,"F4",{"$f":"of:=[Calcoli.H205]+0.5-INT([Calcoli.H205]+0.5)","v":0.670200000051409},null,"F4",{"$f":"of:=[Calcoli.K205]+0.5-INT([Calcoli.K205]+0.5)","v":0.419600000139326},null,"F4",{"$f":"of:=[Calcoli.N205]+0.5-INT([Calcoli.N205]+0.5)","v":0.027900000102818},null,"F4",{"$f":"of:=[Calcoli.Q205]+0.5-INT([Calcoli.Q205]+0.5)","v":0.486099999863654},null,"F4",{"$f":"of:=[Calcoli.T205]+0.5-INT([Calcoli.T205]+0.5)","v":0.814400000032038},null,"F4",{"$f":"of:=[Calcoli.W205]+0.5-INT([Calcoli.W205]+0.5)","v":0.0570999998599291},null,"F4",{"$f":"of:=[Calcoli.Z205]+0.5-INT([Calcoli.Z205]+0.5)","v":0.272100000176579},null,"F4",{"$f":"of:=[Calcoli.AC205]+0.5-INT([Calcoli.AC205]+0.5)","v":0.522299999836832},null,"F4",{"$f":"of:=[Calcoli.AF205]+0.5-INT([Calcoli.AF205]+0.5)","v":0.86310000019148},null,"F4",{"$f":"of:=[Calcoli.AI205]+0.5-INT([Calcoli.AI205]+0.5)","v":0.331400000024587},null,"F4",{"$f":"of:=[Calcoli.AL205]+0.5-INT([Calcoli.AL205]+0.5)","v":0.937799999956042},null,"F4",{"$f":"of:=[Calcoli.AO205]+0.5-INT([Calcoli.AO205]+0.5)","v":0.666499999817461}]
["Ω4",{"$f":"of:=INT(([Calcoli.B206]-1867216.25)/36524.25)","v":16},null,"Ω4",{"$f":"of:=INT(([Calcoli.E206]-1867216.25)/36524.25)","v":16},null,"Ω4",{"$f":"of:=INT(([Calcoli.H206]-1867216.25)/36524.25)","v":16},null,"Ω4",{"$f":"of:=INT(([Calcoli.K206]-1867216.25)/36524.25)","v":16},null,"Ω4",{"$f":"of:=INT(([Calcoli.N206]-1867216.25)/36524.25)","v":16},null,"Ω4",{"$f":"of:=INT(([Calcoli.Q206]-1867216.25)/36524.25)","v":16},null,"Ω4",{"$f":"of:=INT(([Calcoli.T206]-1867216.25)/36524.25)","v":16},null,"Ω4",{"$f":"of:=INT(([Calcoli.W206]-1867216.25)/36524.25)","v":16},null,"Ω4",{"$f":"of:=INT(([Calcoli.Z206]-1867216.25)/36524.25)","v":16},null,"Ω4",{"$f":"of:=INT(([Calcoli.AC206]-1867216.25)/36524.25)","v":16},null,"Ω4",{"$f":"of:=INT(([Calcoli.AF206]-1867216.25)/36524.25)","v":16},null,"Ω4",{"$f":"of:=INT(([Calcoli.AI206]-1867216.25)/36524.25)","v":16},null,"Ω4",{"$f":"of:=INT(([Calcoli.AL206]-1867216.25)/36524.25)","v":16},null,"Ω4",{"$f":"of:=INT(([Calcoli.AO206]-1867216.25)/36524.25)","v":16}]
["A4",{"$f":"of:=IF([Calcoli.B206]<2299161;[Calcoli.B206];[Calcoli.B206]+1+[Calcoli.B208]-INT([Calcoli.B208]/4))","v":2457786},null,"A4",{"$f":"of:=IF([Calcoli.E206]<2299161;[Calcoli.E206];[Calcoli.E206]+1+[Calcoli.E208]-INT([Calcoli.E208]/4))","v":2457816},null,"A4",{"$f":"of:=IF([Calcoli.H206]<2299161;[Calcoli.H206];[Calcoli.H206]+1+[Calcoli.H208]-INT([Calcoli.H208]/4))","v":2457846},null,"A4",{"$f":"of:=IF([Calcoli.K206]<2299161;[Calcoli.K206];[Calcoli.K206]+1+[Calcoli.K208]-INT([Calcoli.K208]/4))","v":2457876},null,"A4",{"$f":"of:=IF([Calcoli.N206]<2299161;[Calcoli.N206];[Calcoli.N206]+1+[Calcoli.N208]-INT([Calcoli.N208]/4))","v":2457906},null,"A4",{"$f":"of:=IF([Calcoli.Q206]<2299161;[Calcoli.Q206];[Calcoli.Q206]+1+[Calcoli.Q208]-INT([Calcoli.Q208]/4))","v":2457935},null,"A4",{"$f":"of:=IF([Calcoli.T206]<2299161;[Calcoli.T206];[Calcoli.T206]+1+[Calcoli.T208]-INT([Calcoli.T208]/4))","v":2457964},null,"A4",{"$f":"of:=IF([Calcoli.W206]<2299161;[Calcoli.W206];[Calcoli.W206]+1+[Calcoli.W208]-INT([Calcoli.W208]/4))","v":2457994},null,"A4",{"$f":"of:=IF([Calcoli.Z206]<2299161;[Calcoli.Z206];[Calcoli.Z206]+1+[Calcoli.Z208]-INT([Calcoli.Z208]/4))","v":2458023},null,"A4",{"$f":"of:=IF([Calcoli.AC206]<2299161;[Calcoli.AC206];[Calcoli.AC206]+1+[Calcoli.AC208]-INT([Calcoli.AC208]/4))","v":2458052},null,"A4",{"$f":"of:=IF([Calcoli.AF206]<2299161;[Calcoli.AF206];[Calcoli.AF206]+1+[Calcoli.AF208]-INT([Calcoli.AF208]/4))","v":2458081},null,"A4",{"$f":"of:=IF([Calcoli.AI206]<2299161;[Calcoli.AI206];[Calcoli.AI206]+1+[Calcoli.AI208]-INT([Calcoli.AI208]/4))","v":2458111},null,"A4",{"$f":"of:=IF([Calcoli.AL206]<2299161;[Calcoli.AL206];[Calcoli.AL206]+1+[Calcoli.AL208]-INT([Calcoli.AL208]/4))","v":2458140},null,"A4",{"$f":"of:=IF([Calcoli.AO206]<2299161;[Calcoli.AO206];[Calcoli.AO206]+1+[Calcoli.AO208]-INT([Calcoli.AO208]/4))","v":2458170}]
["B4",{"$f":"of:=[Calcoli.B209]+1524","v":2459310},null,"B4",{"$f":"of:=[Calcoli.E209]+1524","v":2459340},null,"B4",{"$f":"of:=[Calcoli.H209]+1524","v":2459370},null,"B4",{"$f":"of:=[Calcoli.K209]+1524","v":2459400},null,"B4",{"$f":"of:=[Calcoli.N209]+1524","v":2459430},null,"B4",{"$f":"of:=[Calcoli.Q209]+1524","v":2459459},null,"B4",{"$f":"of:=[Calcoli.T209]+1524","v":2459488},null,"B4",{"$f":"of:=[Calcoli.W209]+1524","v":2459518},null,"B4",{"$f":"of:=[Calcoli.Z209]+1524","v":2459547},null,"B4",{"$f":"of:=[Calcoli.AC209]+1524","v":2459576},null,"B4",{"$f":"of:=[Calcoli.AF209]+1524","v":2459605},null,"B4",{"$f":"of:=[Calcoli.AI209]+1524","v":2459635},null,"B4",{"$f":"of:=[Calcoli.AL209]+1524","v":2459664},null,"B4",{"$f":"of:=[Calcoli.AO209]+1524","v":2459694}]
["C4",{"$f":"of:=INT(([Calcoli.B210]-122.1)/365.25)","v":6732},null,"C4",{"$f":"of:=INT(([Calcoli.E210]-122.1)/365.25)","v":6732},null,"C4",{"$f":"of:=INT(([Calcoli.H210]-122.1)/365.25)","v":6733},null,"C4",{"$f":"of:=INT(([Calcoli.K210]-122.1)/365.25)","v":6733},null,"C4",{"$f":"of:=INT(([Calcoli.N210]-122.1)/365.25)","v":6733},null,"C4",{"$f":"of:=INT(([Calcoli.Q210]-122.1)/365.25)","v":6733},null,"C4",{"$f":"of:=INT(([Calcoli.T210]-122.1)/365.25)","v":6733},null,"C4",{"$f":"of:=INT(([Calcoli.W210]-122.1)/365.25)","v":6733},null,"C4",{"$f":"of:=INT(([Calcoli.Z210]-122.1)/365.25)","v":6733},null,"C4",{"$f":"of:=INT(([Calcoli.AC210]-122.1)/365.25)","v":6733},null,"C4",{"$f":"of:=INT(([Calcoli.AF210]-122.1)/365.25)","v":6733},null,"C4",{"$f":"of:=INT(([Calcoli.AI210]-122.1)/365.25)","v":6733},null,"C4",{"$f":"of:=INT(([Calcoli.AL210]-122.1)/365.25)","v":6733},null,"C4",{"$f":"of:=INT(([Calcoli.AO210]-122.1)/365.25)","v":6733}]
["D4",{"$f":"of:=INT(365.25*[Calcoli.B211])","v":2458863},null,"D4",{"$f":"of:=INT(365.25*[Calcoli.E211])","v":2458863},null,"D4",{"$f":"of:=INT(365.25*[Calcoli.H211])","v":2459228},null,"D4",{"$f":"of:=INT(365.25*[Calcoli.K211])","v":2459228},null,"D4",{"$f":"of:=INT(365.25*[Calcoli.N211])","v":2459228},null,"D4",{"$f":"of:=INT(365.25*[Calcoli.Q211])","v":2459228},null,"D4",{"$f":"of:=INT(365.25*[Calcoli.T211])","v":2459228},null,"D4",{"$f":"of:=INT(365.25*[Calcoli.W211])","v":2459228},null,"D4",{"$f":"of:=INT(365.25*[Calcoli.Z211])","v":2459228},null,"D4",{"$f":"of:=INT(365.25*[Calcoli.AC211])","v":2459228},null,"D4",{"$f":"of:=INT(365.25*[Calcoli.AF211])","v":2459228},null,"D4",{"$f":"of:=INT(365.25*[Calcoli.AI211])","v":2459228},null,"D4",{"$f":"of:=INT(365.25*[Calcoli.AL211])","v":2459228},null,"D4",{"$f":"of:=INT(365.25*[Calcoli.AO211])","v":2459228}]
["E4",{"$f":"of:=INT(([Calcoli.B210]-[Calcoli.B212])/30.6001)","v":14},null,"E4",{"$f":"of:=INT(([Calcoli.E210]-[Calcoli.E212])/30.6001)","v":15},null,"E4",{"$f":"of:=INT(([Calcoli.H210]-[Calcoli.H212])/30.6001)","v":4},null,"E4",{"$f":"of:=INT(([Calcoli.K210]-[Calcoli.K212])/30.6001)","v":5},null,"E4",{"$f":"of:=INT(([Calcoli.N210]-[Calcoli.N212])/30.6001)","v":6},null,"E4",{"$f":"of:=INT(([Calcoli.Q210]-[Calcoli.Q212])/30.6001)","v":7},null,"E4",{"$f":"of:=INT(([Calcoli.T210]-[Calcoli.T212])/30.6001)","v":8},null,"E4",{"$f":"of:=INT(([Calcoli.W210]-[Calcoli.W212])/30.6001)","v":9},null,"E4",{"$f":"of:=INT(([Calcoli.Z210]-[Calcoli.Z212])/30.6001)","v":10},null,"E4",{"$f":"of:=INT(([Calcoli.AC210]-[Calcoli.AC212])/30.6001)","v":11},null,"E4",{"$f":"of:=INT(([Calcoli.AF210]-[Calcoli.AF212])/30.6001)","v":12},null,"E4",{"$f":"of:=INT(([Calcoli.AI210]-[Calcoli.AI212])/30.6001)","v":13},null,"E4",{"$f":"of:=INT(([Calcoli.AL210]-[Calcoli.AL212])/30.6001)","v":14},null,"E4",{"$f":"of:=INT(([Calcoli.AO210]-[Calcoli.AO212])/30.6001)","v":15}]
["Giorno_UQ",{"$f":"of:=ROUND([Calcoli.B210]-[Calcoli.B212]-INT(30.6001*[Calcoli.B213])+[Calcoli.B207];4)","v":19.9288},null,"Giorno_UQ",{"$f":"of:=ROUND([Calcoli.E210]-[Calcoli.E212]-INT(30.6001*[Calcoli.E213])+[Calcoli.E207];4)","v":18.8184},null,"Giorno_UQ",{"$f":"of:=ROUND([Calcoli.H210]-[Calcoli.H212]-INT(30.6001*[Calcoli.H213])+[Calcoli.H207];4)","v":20.6702},null,"Giorno_UQ",{"$f":"of:=ROUND([Calcoli.K210]-[Calcoli.K212]-INT(30.6001*[Calcoli.K213])+[Calcoli.K207];4)","v":19.4196},null,"Giorno_UQ",{"$f":"of:=ROUND([Calcoli.N210]-[Calcoli.N212]-INT(30.6001*[Calcoli.N213])+[Calcoli.N207];4)","v":19.0279},null,"Giorno_UQ",{"$f":"of:=ROUND([Calcoli.Q210]-[Calcoli.Q212]-INT(30.6001*[Calcoli.Q213])+[Calcoli.Q207];4)","v":17.4861},null,"Giorno_UQ",{"$f":"of:=ROUND([Calcoli.T210]-[Calcoli.T212]-INT(30.6001*[Calcoli.T213])+[Calcoli.T207];4)","v":16.8144},null,"Giorno_UQ",{"$f":"of:=ROUND([Calcoli.W210]-[Calcoli.W212]-INT(30.6001*[Calcoli.W213])+[Calcoli.W207];4)","v":15.0571},null,"Giorno_UQ",{"$f":"of:=ROUND([Calcoli.Z210]-[Calcoli.Z212]-INT(30.6001*[Calcoli.Z213])+[Calcoli.Z207];4)","v":13.2721},null,"Giorno_UQ",{"$f":"of:=ROUND([Calcoli.AC210]-[Calcoli.AC212]-INT(30.6001*[Calcoli.AC213])+[Calcoli.AC207];4)","v":12.5223},null,"Giorno_UQ",{"$f":"of:=ROUND([Calcoli.AF210]-[Calcoli.AF212]-INT(30.6001*[Calcoli.AF213])+[Calcoli.AF207];4)","v":10.8631},null,"Giorno_UQ",{"$f":"of:=ROUND([Calcoli.AI210]-[Calcoli.AI212]-INT(30.6001*[Calcoli.AI213])+[Calcoli.AI207];4)","v":10.3314},null,"Giorno_UQ",{"$f":"of:=ROUND([Calcoli.AL210]-[Calcoli.AL212]-INT(30.6001*[Calcoli.AL213])+[Calcoli.AL207];4)","v":8.9378},null,"Giorno_UQ",{"$f":"of:=ROUND([Calcoli.AO210]-[Calcoli.AO212]-INT(30.6001*[Calcoli.AO213])+[Calcoli.AO207];4)","v":7.6665}]
["Mese_UQ",{"$f":"of:=IF([Calcoli.B213]<13.5;[Calcoli.B213]-1;[Calcoli.B213]-13)","v":1},null,"Mese_UQ",{"$f":"of:=IF([Calcoli.E213]<13.5;[Calcoli.E213]-1;[Calcoli.E213]-13)","v":2},null,"Mese_UQ",{"$f":"of:=IF([Calcoli.H213]<13.5;[Calcoli.H213]-1;[Calcoli.H213]-13)","v":3},null,"Mese_UQ",{"$f":"of:=IF([Calcoli.K213]<13.5;[Calcoli.K213]-1;[Calcoli.K213]-13)","v":4},null,"Mese_UQ",{"$f":"of:=IF([Calcoli.N213]<13.5;[Calcoli.N213]-1;[Calcoli.N213]-13)","v":5},null,"Mese_UQ",{"$f":"of:=IF([Calcoli.Q213]<13.5;[Calcoli.Q213]-1;[Calcoli.Q213]-13)","v":6},null,"Mese_UQ",{"$f":"of:=IF([Calcoli.T213]<13.5;[Calcoli.T213]-1;[Calcoli.T213]-13)","v":7},null,"Mese_UQ",{"$f":"of:=IF([Calcoli.W213]<13.5;[Calcoli.W213]-1;[Calcoli.W213]-13)","v":8},null,"Mese_UQ",{"$f":"of:=IF([Calcoli.Z213]<13.5;[Calcoli.Z213]-1;[Calcoli.Z213]-13)","v":9},null,"Mese_UQ",{"$f":"of:=IF([Calcoli.AC213]<13.5;[Calcoli.AC213]-1;[Calcoli.AC213]-13)","v":10},null,"Mese_UQ",{"$f":"of:=IF([Calcoli.AF213]<13.5;[Calcoli.AF213]-1;[Calcoli.AF213]-13)","v":11},null,"Mese_UQ",{"$f":"of:=IF([Calcoli.AI213]<13.5;[Calcoli.AI213]-1;[Calcoli.AI213]-13)","v":12},null,"Mese_UQ",{"$f":"of:=IF([Calcoli.AL213]<13.5;[Calcoli.AL213]-1;[Calcoli.AL213]-13)","v":1},null,"Mese_UQ",{"$f":"of:=IF([Calcoli.AO213]<13.5;[Calcoli.AO213]-1;[Calcoli.AO213]-13)","v":2}]
["ANNO_UQ",{"$f":"of:=IF([Calcoli.B215]>2.5 AND([Calcoli.B215]<12.5);[Calcoli.B211]-4716;[Calcoli.B211]-4715)","v":2017},null,"ANNO_UQ",{"$f":"of:=IF([Calcoli.E215]>2.5 AND([Calcoli.E215]<12.5);[Calcoli.E211]-4716;[Calcoli.E211]-4715)","v":2017},null,"ANNO_UQ",{"$f":"of:=IF([Calcoli.H215]>2.5 AND([Calcoli.H215]<12.5);[Calcoli.H211]-4716;[Calcoli.H211]-4715)","v":2017},null,"ANNO_UQ",{"$f":"of:=IF([Calcoli.K215]>2.5 AND([Calcoli.K215]<12.5);[Calcoli.K211]-4716;[Calcoli.K211]-4715)","v":2017},null,"ANNO_UQ",{"$f":"of:=IF([Calcoli.N215]>2.5 AND([Calcoli.N215]<12.5);[Calcoli.N211]-4716;[Calcoli.N211]-4715)","v":2017},null,"ANNO_UQ",{"$f":"of:=IF([Calcoli.Q215]>2.5 AND([Calcoli.Q215]<12.5);[Calcoli.Q211]-4716;[Calcoli.Q211]-4715)","v":2017},null,"ANNO_UQ",{"$f":"of:=IF([Calcoli.T215]>2.5 AND([Calcoli.T215]<12.5);[Calcoli.T211]-4716;[Calcoli.T211]-4715)","v":2017},null,"ANNO_UQ",{"$f":"of:=IF([Calcoli.W215]>2.5 AND([Calcoli.W215]<12.5);[Calcoli.W211]-4716;[Calcoli.W211]-4715)","v":2017},null,"ANNO_UQ",{"$f":"of:=IF([Calcoli.Z215]>2.5 AND([Calcoli.Z215]<12.5);[Calcoli.Z211]-4716;[Calcoli.Z211]-4715)","v":2017},null,"ANNO_UQ",{"$f":"of:=IF([Calcoli.AC215]>2.5 AND([Calcoli.AC215]<12.5);[Calcoli.AC211]-4716;[Calcoli.AC211]-4715)","v":2017},null,"ANNO_UQ",{"$f":"of:=IF([Calcoli.AF215]>2.5 AND([Calcoli.AF215]<12.5);[Calcoli.AF211]-4716;[Calcoli.AF211]-4715)","v":2017},null,"ANNO_UQ",{"$f":"of:=IF([Calcoli.AI215]>2.5 AND([Calcoli.AI215]<12.5);[Calcoli.AI211]-4716;[Calcoli.AI211]-4715)","v":2017},null,"ANNO_UQ",{"$f":"of:=IF([Calcoli.AL215]>2.5 AND([Calcoli.AL215]<12.5);[Calcoli.AL211]-4716;[Calcoli.AL211]-4715)","v":2018},null,"ANNO_UQ",{"$f":"of:=IF([Calcoli.AO215]>2.5 AND([Calcoli.AO215]<12.5);[Calcoli.AO211]-4716;[Calcoli.AO211]-4715)","v":2018}]
["Data_GD UQ",{"$f":"of:=DATE([Calcoli.B216];[Calcoli.B215];[Calcoli.B214])","v":"2017-01-19"},null,"Data_GD UQ",{"$f":"of:=DATE([Calcoli.E216];[Calcoli.E215];[Calcoli.E214])","v":"2017-02-18"},null,"Data_GD UQ",{"$f":"of:=DATE([Calcoli.H216];[Calcoli.H215];[Calcoli.H214])","v":"2017-03-20"},null,"Data_GD UQ",{"$f":"of:=DATE([Calcoli.K216];[Calcoli.K215];[Calcoli.K214])","v":"2017-04-19"},null,"Data_GD UQ",{"$f":"of:=DATE([Calcoli.N216];[Calcoli.N215];[Calcoli.N214])","v":"2017-05-19"},null,"Data_GD UQ",{"$f":"of:=DATE([Calcoli.Q216];[Calcoli.Q215];[Calcoli.Q214])","v":"2017-06-17"},null,"Data_GD UQ",{"$f":"of:=DATE([Calcoli.T216];[Calcoli.T215];[Calcoli.T214])","v":"2017-07-16"},null,"Data_GD UQ",{"$f":"of:=DATE([Calcoli.W216];[Calcoli.W215];[Calcoli.W214])","v":"2017-08-15"},null,"Data_GD UQ",{"$f":"of:=DATE([Calcoli.Z216];[Calcoli.Z215];[Calcoli.Z214])","v":"2017-09-13"},null,"Data_GD UQ",{"$f":"of:=DATE([Calcoli.AC216];[Calcoli.AC215];[Calcoli.AC214])","v":"2017-10-12"},null,"Data_GD UQ",{"$f":"of:=DATE([Calcoli.AF216];[Calcoli.AF215];[Calcoli.AF214])","v":"2017-11-10"},null,"Data_GD UQ",{"$f":"of:=DATE([Calcoli.AI216];[Calcoli.AI215];[Calcoli.AI214])","v":"2017-12-10"},null,"Data_GD UQ",{"$f":"of:=DATE([Calcoli.AL216];[Calcoli.AL215];[Calcoli.AL214])","v":"2018-01-08"},null,"Data_GD UQ",{"$f":"of:=DATE([Calcoli.AO216];[Calcoli.AO215];[Calcoli.AO214])","v":"2018-02-07"}]
["Ore_GD UQ",{"$f":"of:=INT(([Calcoli.B214]-INT([Calcoli.B214]))*24)+1","v":23},null,"Ore_GD UQ",{"$f":"of:=INT(([Calcoli.E214]-INT([Calcoli.E214]))*24)+1","v":20},null,"Ore_GD UQ",{"$f":"of:=INT(([Calcoli.H214]-INT([Calcoli.H214]))*24)+1","v":17},null,"Ore_GD UQ",{"$f":"of:=INT(([Calcoli.K214]-INT([Calcoli.K214]))*24)+1","v":11},null,"Ore_GD UQ",{"$f":"of:=INT(([Calcoli.N214]-INT([Calcoli.N214]))*24)+1","v":1},null,"Ore_GD UQ",{"$f":"of:=INT(([Calcoli.Q214]-INT([Calcoli.Q214]))*24)+1","v":12},null,"Ore_GD UQ",{"$f":"of:=INT(([Calcoli.T214]-INT([Calcoli.T214]))*24)+1","v":20},null,"Ore_GD UQ",{"$f":"of:=INT(([Calcoli.W214]-INT([Calcoli.W214]))*24)+1","v":2},null,"Ore_GD UQ",{"$f":"of:=INT(([Calcoli.Z214]-INT([Calcoli.Z214]))*24)+1","v":7},null,"Ore_GD UQ",{"$f":"of:=INT(([Calcoli.AC214]-INT([Calcoli.AC214]))*24)+1","v":13},null,"Ore_GD UQ",{"$f":"of:=INT(([Calcoli.AF214]-INT([Calcoli.AF214]))*24)+1","v":21},null,"Ore_GD UQ",{"$f":"of:=INT(([Calcoli.AI214]-INT([Calcoli.AI214]))*24)+1","v":8},null,"Ore_GD UQ",{"$f":"of:=INT(([Calcoli.AL214]-INT([Calcoli.AL214]))*24)+1","v":23},null,"Ore_GD UQ",{"$f":"of:=INT(([Calcoli.AO214]-INT([Calcoli.AO214]))*24)+1","v":16}]
["Minuti_GD UQ",{"$f":"of:=IF(INT((([Calcoli.B214]-INT([Calcoli.B214]))*24-([Calcoli.B218]-1))*60)-4>=0;INT((([Calcoli.B214]-INT([Calcoli.B214]))*24-([Calcoli.B218]-1))*60)-4;INT((([Calcoli.B214]-INT([Calcoli.B214]))*24-([Calcoli.B218]-1))*60))","v":13},null,"Minuti_GD UQ",{"$f":"of:=IF(INT((([Calcoli.E214]-INT([Calcoli.E214]))*24-([Calcoli.E218]-1))*60)-4>=0;INT((([Calcoli.E214]-INT([Calcoli.E214]))*24-([Calcoli.E218]-1))*60)-4;INT((([Calcoli.E214]-INT([Calcoli.E214]))*24-([Calcoli.E218]-1))*60))","v":34},null,"Minuti_GD UQ",{"$f":"of:=IF(INT((([Calcoli.H214]-INT([Calcoli.H214]))*24-([Calcoli.H218]-1))*60)-4>=0;INT((([Calcoli.H214]-INT([Calcoli.H214]))*24-([Calcoli.H218]-1))*60)-4;INT((([Calcoli.H214]-INT([Calcoli.H214]))*24-([Calcoli.H218]-1))*60))","v":1},null,"Minuti_GD UQ",{"$f":"of:=IF(INT((([Calcoli.K214]-INT([Calcoli.K214]))*24-([Calcoli.K218]-1))*60)-4>=0;INT((([Calcoli.K214]-INT([Calcoli.K214]))*24-([Calcoli.K218]-1))*60)-4;INT((([Calcoli.K214]-INT([Calcoli.K214]))*24-([Calcoli.K218]-1))*60))","v":0},null,"Minuti_GD UQ",{"$f":"of:=IF(INT((([Calcoli.N214]-INT([Calcoli.N214]))*24-([Calcoli.N218]-1))*60)-4>=0;INT((([Calcoli.N214]-INT([Calcoli.N214]))*24-([Calcoli.N218]-1))*60)-4;INT((([Calcoli.N214]-INT([Calcoli.N214]))*24-([Calcoli.N218]-1))*60))","v":36},null,"Minuti_GD UQ",{"$f":"of:=IF(INT((([Calcoli.Q214]-INT([Calcoli.Q214]))*24-([Calcoli.Q218]-1))*60)-4>=0;INT((([Calcoli.Q214]-INT([Calcoli.Q214]))*24-([Calcoli.Q218]-1))*60)-4;INT((([Calcoli.Q214]-INT([Calcoli.Q214]))*24-([Calcoli.Q218]-1))*60))","v":35},null,"Minuti_GD UQ",{"$f":"of:=IF(INT((([Calcoli.T214]-INT([Calcoli.T214]))*24-([Calcoli.T218]-1))*60)-4>=0;INT((([Calcoli.T214]-INT([Calcoli.T214]))*24-([Calcoli.T218]-1))*60)-4;INT((([Calcoli.T214]-INT([Calcoli.T214]))*24-([Calcoli.T218]-1))*60))","v":28},null,"Minuti_GD UQ",{"$f":"of:=IF(INT((([Calcoli.W214]-INT([Calcoli.W214]))*24-([Calcoli.W218]-1))*60)-4>=0;INT((([Calcoli.W214]-INT([Calcoli.W214]))*24-([Calcoli.W218]-1))*60)-4;INT((([Calcoli.W214]-INT([Calcoli.W214]))*24-([Calcoli.W218]-1))*60))","v":18},null,"Minuti_GD UQ",{"$f":"of:=IF(INT((([Calcoli.Z214]-INT([Calcoli.Z214]))*24-([Calcoli.Z218]-1))*60)-4>=0;INT((([Calcoli.Z214]-INT([Calcoli.Z214]))*24-([Calcoli.Z218]-1))*60)-4;INT((([Calcoli.Z214]-INT([Calcoli.Z214]))*24-([Calcoli.Z218]-1))*60))","v":27},null,"Minuti_GD UQ",{"$f":"of:=IF(INT((([Calcoli.AC214]-INT([Calcoli.AC214]))*24-([Calcoli.AC218]-1))*60)-4>=0;INT((([Calcoli.AC214]-INT([Calcoli.AC214]))*24-([Calcoli.AC218]-1))*60)-4;INT((([Calcoli.AC214]-INT([Calcoli.AC214]))*24-([Calcoli.AC218]-1))*60))","v":28},null,"Minuti_GD UQ",{"$f":"of:=IF(INT((([Calcoli.AF214]-INT([Calcoli.AF214]))*24-([Calcoli.AF218]-1))*60)-4>=0;INT((([Calcoli.AF214]-INT([Calcoli.AF214]))*24-([Calcoli.AF218]-1))*60)-4;INT((([Calcoli.AF214]-INT([Calcoli.AF214]))*24-([Calcoli.AF218]-1))*60))","v":38},null,"Minuti_GD UQ",{"$f":"of:=IF(INT((([Calcoli.AI214]-INT([Calcoli.AI214]))*24-([Calcoli.AI218]-1))*60)-4>=0;INT((([Calcoli.AI214]-INT([Calcoli.AI214]))*24-([Calcoli.AI218]-1))*60)-4;INT((([Calcoli.AI214]-INT([Calcoli.AI214]))*24-([Calcoli.AI218]-1))*60))","v":53},null,"Minuti_GD UQ",{"$f":"of:=IF(INT((([Calcoli.AL214]-INT([Calcoli.AL214]))*24-([Calcoli.AL218]-1))*60)-4>=0;INT((([Calcoli.AL214]-INT([Calcoli.AL214]))*24-([Calcoli.AL218]-1))*60)-4;INT((([Calcoli.AL214]-INT([Calcoli.AL214]))*24-([Calcoli.AL218]-1))*60))","v":26},null,"Minuti_GD UQ",{"$f":"of:=IF(INT((([Calcoli.AO214]-INT([Calcoli.AO214]))*24-([Calcoli.AO218]-1))*60)-4>=0;INT((([Calcoli.AO214]-INT([Calcoli.AO214]))*24-([Calcoli.AO218]-1))*60)-4;INT((([Calcoli.AO214]-INT([Calcoli.AO214]))*24-([Calcoli.AO218]-1))*60))","v":55}]
["Secondi_GD UQ",{"$f":"of:=INT((((([Calcoli.B214]-INT([Calcoli.B214]))*24-([Calcoli.B218]-1))*60)-[Calcoli.B219]-3)*60)","v":88},null,"Secondi_GD UQ",{"$f":"of:=INT((((([Calcoli.E214]-INT([Calcoli.E214]))*24-([Calcoli.E218]-1))*60)-[Calcoli.E219]-3)*60)","v":89},null,"Secondi_GD UQ",{"$f":"of:=INT((((([Calcoli.H214]-INT([Calcoli.H214]))*24-([Calcoli.H218]-1))*60)-[Calcoli.H219]-3)*60)","v":65},null,"Secondi_GD UQ",{"$f":"of:=INT((((([Calcoli.K214]-INT([Calcoli.K214]))*24-([Calcoli.K218]-1))*60)-[Calcoli.K219]-3)*60)","v":73},null,"Secondi_GD UQ",{"$f":"of:=INT((((([Calcoli.N214]-INT([Calcoli.N214]))*24-([Calcoli.N218]-1))*60)-[Calcoli.N219]-3)*60)","v":70},null,"Secondi_GD UQ",{"$f":"of:=INT((((([Calcoli.Q214]-INT([Calcoli.Q214]))*24-([Calcoli.Q218]-1))*60)-[Calcoli.Q219]-3)*60)","v":119},null,"Secondi_GD UQ",{"$f":"of:=INT((((([Calcoli.T214]-INT([Calcoli.T214]))*24-([Calcoli.T218]-1))*60)-[Calcoli.T219]-3)*60)","v":104},null,"Secondi_GD UQ",{"$f":"of:=INT((((([Calcoli.W214]-INT([Calcoli.W214]))*24-([Calcoli.W218]-1))*60)-[Calcoli.W219]-3)*60)","v":73},null,"Secondi_GD UQ",{"$f":"of:=INT((((([Calcoli.Z214]-INT([Calcoli.Z214]))*24-([Calcoli.Z218]-1))*60)-[Calcoli.Z219]-3)*60)","v":109},null,"Secondi_GD UQ",{"$f":"of:=INT((((([Calcoli.AC214]-INT([Calcoli.AC214]))*24-([Calcoli.AC218]-1))*60)-[Calcoli.AC219]-3)*60)","v":66},null,"Secondi_GD UQ",{"$f":"of:=INT((((([Calcoli.AF214]-INT([Calcoli.AF214]))*24-([Calcoli.AF218]-1))*60)-[Calcoli.AF219]-3)*60)","v":111},null,"Secondi_GD UQ",{"$f":"of:=INT((((([Calcoli.AI214]-INT([Calcoli.AI214]))*24-([Calcoli.AI218]-1))*60)-[Calcoli.AI219]-3)*60)","v":72},null,"Secondi_GD UQ",{"$f":"of:=INT((((([Calcoli.AL214]-INT([Calcoli.AL214]))*24-([Calcoli.AL218]-1))*60)-[Calcoli.AL219]-3)*60)","v":85},null,"Secondi_GD UQ",{"$f":"of:=INT((((([Calcoli.AO214]-INT([Calcoli.AO214]))*24-([Calcoli.AO218]-1))*60)-[Calcoli.AO219]-3)*60)","v":105}]
[]
["Eq. Marzo",{"$f":"of:=1721139.2855+365.2421376*[Calcoli.$G$2]+0.067919*([Calcoli.$G$2]/1000)^2-0.0027879*([Calcoli.$G$2]/1000)^3","v":2457832.93047654},null,"Sol. Giugno",{"$f":"of:=1721233.2486+365.2417284*[Calcoli.$G$2]-0.053018*([Calcoli.$G$2]/1000)^2+0.009332*([Calcoli.$G$2]/1000)^3","v":2457925.67566621},null,"Eq. Settembre",{"$f":"of:=1721325.6978+365.2425055*[Calcoli.$G$2]-0.126689*([Calcoli.$G$2]/1000)^2+0.0019401*([Calcoli.$G$2]/1000)^3","v":2458019.33190599},null,"Sol. Dicembre",{"$f":"of:=1721414.392+365.2428898*[Calcoli.$G$2]-0.010965*([Calcoli.$G$2]/1000)^2-0.0084885*([Calcoli.$G$2]/1000)^3","v":2458109.1864634}]
["Eq. Marzo_1",{"$f":"of:=[Calcoli.B222]+0.5","v":2457833.43047654},null,"Sol. Giugno_1",{"$f":"of:=[Calcoli.E222]+0.5","v":2457926.17566621},null,"Eq. Settembre_1",{"$f":"of:=[Calcoli.H222]+0.5","v":2458019.83190599},null,"Sol. Dicembre_1",{"$f":"of:=[Calcoli.K222]+0.5","v":2458109.6864634}]
["Zm",{"$f":"of:=INT([Calcoli.B223])","v":2457833},null,"Zg",{"$f":"of:=INT([Calcoli.E223])","v":2457926},null,"Zs",{"$f":"of:=INT([Calcoli.H223])","v":2458019},null,"Zd",{"$f":"of:=INT([Calcoli.K223])","v":2458109}]
["Fm",{"$f":"of:=[Calcoli.B223]-[Calcoli.B224]","v":0.430476539768279},null,"Fg",{"$f":"of:=[Calcoli.E223]-[Calcoli.E224]","v":0.175666209310293},null,"Fs",{"$f":"of:=[Calcoli.H223]-[Calcoli.H224]","v":0.831905988976359},null,"Fd",{"$f":"of:=[Calcoli.K223]-[Calcoli.K224]","v":0.686463396064937}]
["Ωm",{"$f":"of:=INT(([Calcoli.B224]-1867216.25)/36524.25)","v":16},null,"Ωg",{"$f":"of:=INT(([Calcoli.E224]-1867216.25)/36524.25)","v":16},null,"Ωs",{"$f":"of:=INT(([Calcoli.H224]-1867216.25)/36524.25)","v":16},null,"Ωd",{"$f":"of:=INT(([Calcoli.K224]-1867216.25)/36524.25)","v":16}]
["Am",{"$f":"of:=IF([Calcoli.B224]>=2299161;[Calcoli.B224]+1+[Calcoli.B226]-INT([Calcoli.B226]/4);[Calcoli.B224])","v":2457846},null,"Ag",{"$f":"of:=IF([Calcoli.E224]>=2299161;[Calcoli.E224]+1+[Calcoli.E226]-INT([Calcoli.E226]/4);[Calcoli.E224])","v":2457939},null,"As",{"$f":"of:=IF([Calcoli.H224]>=2299161;[Calcoli.H224]+1+[Calcoli.H226]-INT([Calcoli.H226]/4);[Calcoli.H224])","v":2458032},null,"Ad",{"$f":"of:=IF([Calcoli.K224]>=2299161;[Calcoli.K224]+1+[Calcoli.K226]-INT([Calcoli.K226]/4);[Calcoli.K224])","v":2458122}]
["Bm",{"$f":"of:=[Calcoli.B227]+1524","v":2459370},null,"Bg",{"$f":"of:=[Calcoli.E227]+1524","v":2459463},null,"Bs",{"$f":"of:=[Calcoli.H227]+1524","v":2459556},null,"Bd",{"$f":"of:=[Calcoli.K227]+1524","v":2459646}]
["Cm",{"$f":"of:=INT(([Calcoli.B228]-122.1)/365.25)","v":6733},null,"Cg",{"$f":"of:=INT(([Calcoli.E228]-122.1)/365.25)","v":6733},null,"Cs",{"$f":"of:=INT(([Calcoli.H228]-122.1)/365.25)","v":6733},null,"Cd",{"$f":"of:=INT(([Calcoli.K228]-122.1)/365.25)","v":6733}]
["Dm",{"$f":"of:=INT(365.25*[Calcoli.B229])","v":2459228},null,"Dg",{"$f":"of:=INT(365.25*[Calcoli.E229])","v":2459228},null,"Ds",{"$f":"of:=INT(365.25*[Calcoli.H229])","v":2459228},null,"Dd",{"$f":"of:=INT(365.25*[Calcoli.K229])","v":2459228}]
["Em",{"$f":"of:=INT(([Calcoli.B228]-[Calcoli.B230])/30.6001)","v":4},null,"Eg",{"$f":"of:=INT(([Calcoli.E228]-[Calcoli.E230])/30.6001)","v":7},null,"Es",{"$f":"of:=INT(([Calcoli.H228]-[Calcoli.H230])/30.6001)","v":10},null,"Ed",{"$f":"of:=INT(([Calcoli.K228]-[Calcoli.K230])/30.6001)","v":13}]
["Giorno_m",{"$f":"of:=[Calcoli.B228]-[Calcoli.B230]-INT(30.6001*[Calcoli.B231])+[Calcoli.B225]","v":20.4304765411653},null,"Giorno_g",{"$f":"of:=[Calcoli.E228]-[Calcoli.E230]-INT(30.6001*[Calcoli.E231])+[Calcoli.E225]","v":21.1756662093103},null,"Giorno_s",{"$f":"of:=[Calcoli.H228]-[Calcoli.H230]-INT(30.6001*[Calcoli.H231])+[Calcoli.H225]","v":22.8319059889764},null,"Giorno_d",{"$f":"of:=[Calcoli.K228]-[Calcoli.K230]-INT(30.6001*[Calcoli.K231])+[Calcoli.K225]","v":21.6864633960649}]
["Mese_m",{"$f":"of:=IF([Calcoli.B231]<13.5;[Calcoli.B231]-1;[Calcoli.B231]-13)","v":3},null,"Mese_g",{"$f":"of:=IF([Calcoli.E231]<13.5;[Calcoli.E231]-1;[Calcoli.E231]-13)","v":6},null,"Mese_s",{"$f":"of:=IF([Calcoli.H231]<13.5;[Calcoli.H231]-1;[Calcoli.H231]-13)","v":9},null,"Mese_d",{"$f":"of:=IF([Calcoli.K231]<13.5;[Calcoli.K231]-1;[Calcoli.K231]-13)","v":12}]
["Anno_m",{"$f":"of:=IF([Calcoli.A233]>2.5;[Calcoli.B229]-4716;[Calcoli.B229]-4715)","v":2017},null,"Anno_g",{"$f":"of:=IF([Calcoli.D233]>2.5;[Calcoli.E229]-4716;[Calcoli.E229]-4715)","v":2017},null,"Anno_s",{"$f":"of:=IF([Calcoli.G233]>2.5;[Calcoli.H229]-4716;[Calcoli.H229]-4715)","v":2017},null,"Anno_d",{"$f":"of:=IF([Calcoli.J233]>2.5;[Calcoli.K229]-4716;[Calcoli.K229]-4715)","v":2017}]
["Data_m",{"$f":"of:=DATE([Calcoli.B234];[Calcoli.B233];[Calcoli.B232])","v":"2017-03-20"},null,"Data_g",{"$f":"of:=DATE([Calcoli.E234];[Calcoli.E233];[Calcoli.E232])","v":"2017-06-21"},null,"Data_s",{"$f":"of:=DATE([Calcoli.H234];[Calcoli.H233];[Calcoli.H232])","v":"2017-09-22"},null,"Data_d",{"$f":"of:=DATE([Calcoli.K234];[Calcoli.K233];[Calcoli.K232])","v":"2017-12-21"}]
["Ore_m",{"$f":"of:=INT(([Calcoli.B232]-INT([Calcoli.B232]))*24)+1","v":11},null,"Ore_g",{"$f":"of:=INT(([Calcoli.E232]-INT([Calcoli.E232]))*24)+2","v":6},null,"Ore_s",{"$f":"of:=INT(([Calcoli.H232]-INT([Calcoli.H232]))*24)+2","v":21},null,"Ore_d",{"$f":"of:=INT(([Calcoli.K232]-INT([Calcoli.K232]))*24)+1","v":17}]
["Minuti_m",{"$f":"of:=INT((([Calcoli.B232]-INT([Calcoli.B232]))*24-([Calcoli.B236]-1))*60)+7","v":26},null,"Minuti_g",{"$f":"of:=INT((([Calcoli.E232]-INT([Calcoli.E232]))*24-([Calcoli.E236]-1))*60)+7","v":-41},null,"Minuti_s",{"$f":"of:=INT((([Calcoli.H232]-INT([Calcoli.H232]))*24-([Calcoli.H236]-1))*60)+8","v":5},null,"Minuti_d",{"$f":"of:=INT((([Calcoli.K232]-INT([Calcoli.K232]))*24-([Calcoli.K236]-1))*60)+4","v":32}]
["Secondi_m",{"$f":"of:=INT((((([Calcoli.B232]-INT([Calcoli.B232]))*24-([Calcoli.B236]-1))*60)-[Calcoli.B237])*60)","v":-367},null,"Secondi_g",{"$f":"of:=INT((((([Calcoli.E232]-INT([Calcoli.E232]))*24-([Calcoli.E236]-1))*60)-[Calcoli.E237])*60)","v":-363},null,"Secondi_s",{"$f":"of:=INT((((([Calcoli.H232]-INT([Calcoli.H232]))*24-([Calcoli.H236]-1))*60)-[Calcoli.H237])*60)","v":-424},null,"Secondi_d",{"$f":"of:=INT((((([Calcoli.K232]-INT([Calcoli.K232]))*24-([Calcoli.K236]-1))*60)-[Calcoli.K237])*60)","v":-210}]
[]
["Inizio ora legale ",{"$f":"of:=IF(WEEKDAY(DATE(YEAR([Calcoli.$D$4]);3;25))=1;DATE(YEAR([Calcoli.$D$4]);3;25);IF(WEEKDAY(DATE(YEAR([Calcoli.$D$4]);3;26))=1;DATE(YEAR([Calcoli.$D$4]);3;26);IF(WEEKDAY(DATE(YEAR([Calcoli.$D$4]);3;27))=1;DATE(YEAR([Calcoli.$D$4]);3;27);IF(WEEKDAY(DATE(YEAR([Calcoli.$D$4]);3;28))=1;DATE(YEAR([Calcoli.$D$4]);3;28);IF(WEEKDAY(DATE(YEAR([Calcoli.$D$4]);3;29))=1;DATE(YEAR([Calcoli.$D$4]);3;29);IF(WEEKDAY(DATE(YEAR([Calcoli.$D$4]);3;30))=1;DATE(YEAR([Calcoli.$D$4]);3;30);IF(WEEKDAY(DATE(YEAR([Calcoli.$D$4]);3;31))=1;DATE(YEAR([Calcoli.$D$4]);3;31))))))))","v":"2017-03-26"}]
["Fine ora legale ",{"$f":"of:=IF(WEEKDAY(DATE(YEAR([Calcoli.$D$4]);10;25))=1;DATE(YEAR([Calcoli.$D$4]);10;25);IF(WEEKDAY(DATE(YEAR([Calcoli.$D$4]);10;26))=1;DATE(YEAR([Calcoli.$D$4]);10;26);IF(WEEKDAY(DATE(YEAR([Calcoli.$D$4]);10;27))=1;DATE(YEAR([Calcoli.$D$4]);10;27);IF(WEEKDAY(DATE(YEAR([Calcoli.$D$4]);10;28))=1;DATE(YEAR([Calcoli.$D$4]);10;28);IF(WEEKDAY(DATE(YEAR([Calcoli.$D$4]);10;29))=1;DATE(YEAR([Calcoli.$D$4]);10;29);IF(WEEKDAY(DATE(YEAR([Calcoli.$D$4]);10;30))=1;DATE(YEAR([Calcoli.$D$4]);10;30);IF(WEEKDAY(DATE(YEAR([Calcoli.$D$4]);10;31))=1;DATE(YEAR([Calcoli.$D$4]);10;31))))))))","v":"2017-10-29"}]